{"text_format":"1","workbook":"xlsx","n_sheets":34,"sheets":["Field of Play","Game Info","Settings & Expansion","Angels","Astros","Athletics","BlueJays","Braves","Brewers","Cardinals","Cubs","DBacks","Dodgers","Giants","Indians","Mariners","Marlins","Mets","Nationals","Orioles","Padres","Phillies","Pirates","Rangers","Rays","RedSox","Reds","Rockies","Royals","Tigers","Twins","WhiteSox","Yankees","Production"],"not_rendered":{"charts":2,"images":12,"macros":1,"external_links":1,"defined_names":0,"comments":0,"pivot_tables":0},"unopened":[],"bounds":{"document_bytes":16777216,"sheet_cells":100000,"rows_first":2000,"rows_last":500,"rows_between":2000,"halvings":0,"cell_chars":16384,"cell_head_chars":4096},"cells_cut":0,"cells_raw":0,"read":"whole","date_system":"1900"}

{"sheet":"Field of Play","index":0,"n_rows":32,"n_cols":21,"rows_kept":32,"cut":false,"hidden":false,"merged":[[31,12,31,13],[3,16,3,19],[4,16,4,17],[5,16,5,17],[6,16,6,17],[8,16,8,17],[10,16,11,19],[14,16,14,19],[7,16,7,17]]}
[null,1,2,3,4,5,6,7,8,9,10,11,"R","H","E"]
[{"$f":"'Game Info'!B2","v":"Indians"},null,null,null,null,null,null,null,null,null,null,null,{"$f":"SUM(B2:L2)","v":0},{"$f":"'Game Info'!B7","v":0},{"$f":"'Game Info'!B9","v":0}]
[{"$f":"'Game Info'!B1","v":"BlueJays"},null,null,null,null,null,null,null,null,null,null,null,{"$f":"SUM(B3:L3)","v":0},{"$f":"'Game Info'!B8","v":0},{"$f":"'Game Info'!B10","v":0}]
[null,null,null,null,null,null,null,null,null,null,null,null,null,null,null,null,"THE MATCH UP"]
[null,null,null,null,null,null,null,null,null,null,"Away",1,{"$f":"'Game Info'!O2","v":"CF"},{"$f":"'Game Info'!P2","v":"M Brantley"},{"$f":"IF('Game Info'!Q2=\"\",\"\",'Game Info'!Q2)","v":"*"},null,"Baseline Batting Average:",null,null,{"$f":"'Settings & Expansion'!D1","v":0.26100000000000001}]
[null,null,null,null,null,null,null,null,null,null,{"$f":"A2","v":"Indians"},2,{"$f":"'Game Info'!O3","v":"SS"},{"$f":"'Game Info'!P3","v":"A Cabrera"},{"$f":"IF('Game Info'!Q3=\"\",\"\",'Game Info'!Q3)","v":""},null,{"$f":"'Game Info'!C23&\" Contact Rating:\"","v":"M Brantley Contact Rating:"},null,":",{"$f":"'Game Info'!D23","v":42}]
{"$rows_left_out":27}
{"sheet":"Game Info","index":1,"n_rows":46,"n_cols":22,"rows_kept":46,"cut":false,"hidden":false,"merged":[]}
["Home Team","BlueJays","Fielding",null,null,null,null,null,"Contact","Power","Speed","Def/Arm","Bunt",null,null,null,null,"Contact","Power","Speed","Def/Arm","Bunt"]
["Away Team","Indians",{"$f":"IF(C1=\"Batting\",\"Fielding\",\"Batting\")","v":"Batting"},null,"Home Lineup",{"$f":"INDIRECT(B1&\"!N1\")","v":"LF"},{"$f":"INDIRECT(B1&\"!O1\")","v":"F Lewis"},"*",{"$f":"VLOOKUP(G2,INDIRECT($B$1&\"!A1:F100\"),3,FALSE)","v":51},{"$f":"VLOOKUP(G2,INDIRECT($B$1&\"!A1:F100\"),4,FALSE)","v":53},{"$f":"IFERROR(VLOOKUP(G2,INDIRECT($B$1&\"!A11:F100\"),5,FALSE),20)","v":60},{"$f":"IFERROR(VLOOKUP(G2,INDIRECT($B$1&\"!A1:F100\"),6,FALSE),0)","v":65},{"$f":"IF(VLOOKUP(G2,INDIRECT($B$1&\"!A1:G100\"),7,FALSE)=0,50,VLOOKUP(G2,INDIRECT($B$1&\"!A1:G100\"),7,FALSE))","v":60},"Away Lineup",{"$f":"INDIRECT(B2&\"!N1\")","v":"CF"},{"$f":"INDIRECT(B2&\"!O1\")","v":"M Brantley"},"*",{"$f":"IFERROR(VLOOKUP(P2,INDIRECT($B$2&\"!A1:F100\"),3,FALSE),20)","v":42},{"$f":"IFERROR(VLOOKUP(P2,INDIRECT($B$2&\"!A1:F100\"),4,FALSE),20)","v":35},{"$f":"IFERROR(VLOOKUP(P2,INDIRECT($B$2&\"!A1:F100\"),5,FALSE),20)","v":85},{"$f":"IFERROR(VLOOKUP(P2,INDIRECT($B$2&\"!A1:F100\"),6,FALSE),0)","v":70},{"$f":"IF(VLOOKUP(P2,INDIRECT($B$2&\"!A1:G100\"),7,FALSE)=0,50,VLOOKUP(P2,INDIRECT($B$2&\"!A1:G100\"),7,FALSE))","v":65}]
[null,null,null,null,null,{"$f":"INDIRECT(B1&\"!N2\")","v":"SS"},{"$f":"INDIRECT(B1&\"!O2\")","v":"A Gonzalez"},null,{"$f":"VLOOKUP(G3,INDIRECT($B$1&\"!A1:F100\"),3,FALSE)","v":49},{"$f":"VLOOKUP(G3,INDIRECT($B$1&\"!A1:F100\"),4,FALSE)","v":69},70,20,60,null,{"$f":"INDIRECT(B2&\"!N2\")","v":"SS"},{"$f":"INDIRECT(B2&\"!O2\")","v":"A Cabrera"},null,58,39,75,{"$f":"IFERROR(VLOOKUP(P3,INDIRECT($B$2&\"!A1:F100\"),6,FALSE),0)","v":20},80]
["Outs",0,null,null,null,{"$f":"INDIRECT(B1&\"!N3\")","v":"RF"},{"$f":"INDIRECT(B1&\"!O3\")","v":"J Bautista"},null,49,93,60,75,25,null,{"$f":"INDIRECT(B2&\"!N3\")","v":"RF"},{"$f":"INDIRECT(B2&\"!O3\")","v":"S Choo"},null,72,67,80,{"$f":"IFERROR(VLOOKUP(P4,INDIRECT($B$2&\"!A1:F100\"),6,FALSE),0)","v":90},35]
[null,null,null,null,null,{"$f":"INDIRECT(B1&\"!N4\")","v":"CF"},{"$f":"INDIRECT(B1&\"!O4\")","v":"V Wells"},null,57,73,75,80,35,null,{"$f":"INDIRECT(B2&\"!N4\")","v":"LF"},{"$f":"INDIRECT(B2&\"!O4\")","v":"S Duncan"},null,33,54,45,{"$f":"IFERROR(VLOOKUP(P5,INDIRECT($B$2&\"!A1:F100\"),6,FALSE),0)","v":55},50]
["Inning",1,{"$f":"IF(C1=\"Fielding\",\"Top\",\"Bottom\")","v":"Top"},null,null,{"$f":"INDIRECT(B1&\"!N5\")","v":"DH"},{"$f":"INDIRECT(B1&\"!O5\")","v":"A Lind"},null,37,55,40,20,40,null,{"$f":"INDIRECT(B2&\"!N5\")","v":"C"},{"$f":"INDIRECT(B2&\"!O5\")","v":"C Santana"},null,49,63,30,{"$f":"IFERROR(VLOOKUP(P6,INDIRECT($B$2&\"!A1:F100\"),6,FALSE),0)","v":80},60]
{"$rows_left_out":41}
{"sheet":"Settings & Expansion","index":2,"n_rows":98,"n_cols":4,"rows_kept":98,"cut":false,"hidden":false,"merged":[[0,0,0,2],[2,0,3,10],[44,0,45,10],[89,0,90,10]]}
["Baseline batting average:",null,null,0.26100000000000001]
[]
["GAME PLAY"]
[]
[]
["Welcome to Will Morrison's Excel Baseball.  This page is designed to help with any game play questions that may come up."]
{"$rows_left_out":93}
{"sheet":"Angels","index":3,"n_rows":73,"n_cols":23,"rows_kept":73,"cut":false,"hidden":false,"merged":[]}
["PITCHERS",null,"WHIP","Stamina",1,"SS","E Aybar",null,1,"J Weaver",null,null,1,"SS","E Aybar"]
["J Weaver",null,75,1,2,"RF","B Abreu",null,2,"E Santana",null,null,2,"RF","B Abreu"]
["E Santana",null,53,1,3,"CF","T Hunter",null,3,"J Piniero",null,null,3,"CF","T Hunter"]
["J Piniero",null,60,1,4,"1B","K Morales",null,4,"S Kazmir",null,null,4,"1B","K Morales"]
["S Kazmir",null,29,1,5,"DH","H Matsui",null,null,null,null,null,5,"DH","H Matsui"]
["B Fuentes",null,64,3,6,"LF","J Rivera",null,null,null,null,null,6,"LF","J Rivera"]
{"$rows_left_out":68}
{"sheet":"Astros","index":4,"n_rows":73,"n_cols":406,"rows_kept":73,"cut":false,"hidden":false,"merged":[]}
["PITCHERS",null,"Effectiveness","Stamina",1,"CF","M Bourn",null,1,"R Oswalt",null,null,1,"CF","M Bourn"]
["R Oswalt",null,72,1,2,"2B","J Keppinger",null,2,"B Myers",null,null,2,"2B","J Keppinger"]
["B Myers",null,60,1,3,"RF","H Pence",null,3,"W Rodriguez",null,null,3,"RF","H Pence"]
["W Rodriguez",null,56,1,4,"1B","L Berkman",null,4,"B Norris",null,null,4,"1B","L Berkman"]
["B Norris",null,38,1,5,"LF","C Lee",null,null,null,null,null,5,"LF","C Lee"]
["M Lindstrom",null,23,3,6,"3B","C Johnson",null,null,null,null,null,6,"3B","C Johnson"]
{"$rows_left_out":68}
{"sheet":"Athletics","index":5,"n_rows":73,"n_cols":23,"rows_kept":73,"cut":false,"hidden":false,"merged":[]}
["PITCHERS",null,"Effectiveness","Stamina",1,"CF","R Davis",null,1,"G Gonzalez",null,null,1,"CF","R Davis"]
["G Gonzalez",null,54,1,2,"1B","D Barton",null,2,"T Cahill",null,null,2,"1B","D Barton"]
["T Cahill",null,72,1,3,"C","K Suzuki",null,3,"D Braden",null,null,3,"C","K Suzuki"]
["D Braden",null,68,1,4,"3B","K Kouzmanoff",null,4,"B Anderson",null,null,4,"3B","K Kouzmanoff"]
["B Anderson",null,64,1,5,"DH","J Cust",null,null,null,null,null,5,"DH","J Cust"]
["A Bailey",null,86,3,6,"RF","R Sweeney",null,null,null,null,null,6,"RF","R Sweeney"]
{"$rows_left_out":68}
{"sheet":"BlueJays","index":6,"n_rows":73,"n_cols":23,"rows_kept":73,"cut":false,"hidden":false,"merged":[]}
["PITCHERS",null,"Effectiveness","Stamina",1,"LF","F Lewis",null,1,"R Romero",null,null,1,"LF","F Lewis"]
["R Romero",null,55,1,2,"SS","A Gonzalez",null,2,"S Marcum",null,null,2,"SS","A Gonzalez"]
["S Marcum",null,68,1,3,"RF","J Bautista",null,3,"B Cecil",null,null,3,"RF","J Bautista"]
["B Cecil",null,52,1,4,"CF","V Wells",null,4,"B Morrow",null,null,4,"CF","V Wells"]
["B Morrow",null,47,1,5,"DH","A Lind",null,null,null,null,null,5,"DH","A Lind"]
["M Rzepczynski",null,27,2,6,"C","J Buck",null,null,null,null,null,6,"C","J Buck"]
{"$rows_left_out":68}
{"sheet":"Braves","index":7,"n_rows":73,"n_cols":406,"rows_kept":73,"cut":false,"hidden":false,"merged":[]}
["PITCHERS",null,"Effectiveness","Stamina",1,"2B","M Prado",null,1,"T Hudson",null,null,1,"2B","M Prado"]
["T Hudson",null,68,1,2,"LF","M Cabrera",null,2,"T Hanson",null,null,2,"LF","M Cabrera"]
["T Hanson",null,66,1,3,"3B","O Infante",null,3,"D Lowe",null,null,3,"3B","O Infante"]
["D Lowe",null,48,1,4,"RF","J Heyward",null,4,"J Jurrjens",null,null,4,"RF","J Heyward"]
["J Jurrjens",null,46,1,5,"1B","T Glaus",null,null,null,null,null,5,"1B","T Glaus"]
["B Wagner",null,94,3,6,"C","B McCann",null,null,null,null,null,6,"C","B McCann"]
{"$rows_left_out":68}
{"sheet":"Brewers","index":8,"n_rows":73,"n_cols":406,"rows_kept":73,"cut":false,"hidden":false,"merged":[]}
["PITCHERS",null,"Effectiveness","Stamina",1,"2B","R Weeks",null,1,"R Wolf",null,null,1,"2B","R Weeks"]
["R Wolf",null,46,1,2,"CF","C Gomez",null,2,"Y Gallardo",null,null,2,"CF","C Gomez"]
["Y Gallardo",null,48,1,3,"LF","R Braun",null,3,"D Bush",null,null,3,"LF","R Braun"]
["D Bush",null,36,1,4,"1B","P Fielder",null,4,"C Narveson",null,null,4,"1B","P Fielder"]
["C Narveson",null,47,1,5,"RF","C Hart",null,null,null,null,null,5,"RF","C Hart"]
["J Axford",null,65,3,6,"3B","C McGehee",null,null,null,null,null,6,"3B","C McGehee"]
{"$rows_left_out":68}
{"sheet":"Cardinals","index":9,"n_rows":73,"n_cols":406,"rows_kept":73,"cut":false,"hidden":false,"merged":[]}
["PITCHERS",null,"Effectiveness","Stamina",1,"2B","S Schumaker",null,1,"C Carpenter",null,null,1,"2B","S Schumaker"]
["C Carpenter",null,66,1,2,"CF","C Rasmus",null,2,"A Wainwright",null,null,2,"CF","C Rasmus"]
["A Wainwright",null,77,1,3,"1B","A Pujols",null,3,"J Garcia",null,null,3,"1B","A Pujols"]
["J Garcia",null,53,1,4,"LF","M Holliday",null,4,"K Lohse",null,null,4,"LF","M Holliday"]
["K Lohse",null,11,1,5,"RF","R Ludwick",null,null,null,null,null,5,"RF","R Ludwick"]
["J Suppan",null,37,2,6,"3B","D Freese",null,null,null,null,null,6,"3B","D Freese"]
{"$rows_left_out":68}
{"sheet":"Cubs","index":10,"n_rows":73,"n_cols":406,"rows_kept":73,"cut":false,"hidden":false,"merged":[]}
["PITCHERS",null,"Effectiveness","Stamina",1,"CF","M Byrd",null,1,"R Dempster",null,null,1,"CF","M Byrd"]
["R Dempster",null,53,1,2,"SS","S Castro",null,2,"R Wells",null,null,2,"SS","S Castro"]
["R Wells",null,45,1,3,"1B","D Lee",null,3,"C Silva",null,null,3,"1B","D Lee"]
["C Silva",null,57,1,4,"3B","A Ramirez",null,4,"T Lilly",null,null,4,"3B","A Ramirez"]
["T Lilly",null,69,1,5,"LF","A Soriano",null,null,null,null,null,5,"LF","A Soriano"]
["C Zambrano",null,41,2,6,"C","G Soto",null,null,null,null,null,6,"C","G Soto"]
{"$rows_left_out":68}
{"sheet":"DBacks","index":11,"n_rows":73,"n_cols":23,"rows_kept":73,"cut":false,"hidden":false,"merged":[]}
["PITCHERS",null,"Effectiveness","Stamina",1,"CF","C Young",null,1,"R Lopez",null,null,1,"CF","C Young"]
["R Lopez",null,44,1,2,"2B","K Johnson",null,2,"I Kennedy",null,null,2,"2B","K Johnson"]
["I Kennedy",null,64,1,3,"RF","J Upton",null,3,"D Haren",null,null,3,"RF","J Upton"]
["D Haren",null,50,1,4,"C","M Montero",null,4,"E Jackson",null,null,4,"C","M Montero"]
["E Jackson",null,37,1,5,"3B","M Reynolds",null,null,null,null,null,5,"3B","M Reynolds"]
["J Gutierrez",null,48,3,6,"1B","A LaRoche",null,null,null,null,null,6,"1B","A LaRoche"]
{"$rows_left_out":68}
{"sheet":"Dodgers","index":12,"n_rows":73,"n_cols":23,"rows_kept":73,"cut":false,"hidden":false,"merged":[]}
["PITCHERS",null,"Effectiveness","Stamina",1,"SS","R Furcal",null,1,"C Kershaw",null,null,1,"SS","R Furcal"]
["C Kershaw",null,66,1,2,"C","R Martin",null,2,"H Kuroda",null,null,2,"C","R Martin"]
["H Kuroda",null,67,1,3,"RF","A Ethier",null,3,"C Billingsley",null,null,3,"RF","A Ethier"]
["C Billingsley",null,57,1,4,"LF","M Ramirez",null,4,"V Padilla",null,null,4,"LF","M Ramirez"]
["V Padilla",null,74,1,5,"CF","M Kemp",null,null,null,null,null,5,"CF","M Kemp"]
["J Ely",null,41,2,6,"1B","J Loney",null,null,null,null,null,6,"1B","J Loney"]
{"$rows_left_out":68}
{"sheet":"Giants","index":13,"n_rows":73,"n_cols":406,"rows_kept":73,"cut":false,"hidden":false,"merged":[]}
["PITCHERS",null,"Effectiveness","Stamina",1,"CF","A Torres",null,1,"T Lincecum",null,null,1,"CF","A Torres"]
["M Cain",null,74,1,2,"2B","F Sanchez",null,2,"M Cain",null,null,2,"2B","F Sanchez"]
["T Lincecum",null,57,1,3,"C","B Posey",null,3,"J Sanchez",null,null,3,"C","B Posey"]
["J Sanchez",null,61,1,4,"LF","C Ross",null,4,"M Bumgarner",null,null,4,"LF","C Ross"]
["M Bumgarner",null,54,1,5,"1B","A Huff",null,null,null,null,null,5,"1B","A Huff"]
["B Zito",null,51,2,6,"3B","J Uribe",null,null,null,null,null,6,"3B","J Uribe"]
{"$rows_left_out":68}
{"sheet":"Indians","index":14,"n_rows":73,"n_cols":23,"rows_kept":73,"cut":false,"hidden":false,"merged":[]}
["PITCHERS",null,"WHIP","Stamina",1,"CF","M Brantley",null,1,"F Carmona",null,null,1,"CF","M Brantley"]
["F Carmona",null,54,1,2,"SS","A Cabrera",null,2,"J Masterson",null,null,2,"SS","A Cabrera"]
["J Masterson",null,36,1,3,"RF","S Choo",null,3,"J Westbrook",null,null,3,"RF","S Choo"]
["J Westbrook",null,47,1,4,"LF","S Duncan",null,4,"M Talbot",null,null,4,"LF","S Duncan"]
["M Talbot",null,37,1,5,"C","C Santana",null,null,null,null,null,5,"C","C Santana"]
["J Tomlin",null,59,2,6,"DH","T Hafner",null,null,null,null,null,6,"DH","T Hafner"]
{"$rows_left_out":68}
{"sheet":"Mariners","index":15,"n_rows":73,"n_cols":23,"rows_kept":73,"cut":false,"hidden":false,"merged":[]}
["PITCHERS",null,"Effectiveness","Stamina",1,"RF","Ichiro",null,1,"F Hernandez",null,null,1,"RF","Ichiro"]
["F Hernandez",null,77,1,2,"2B","C Figgins",null,2,"J Vargas",null,null,2,"2B","C Figgins"]
["J Vargas",null,59,1,3,"CF","F Gutierrez",null,3,"D Fister",null,null,3,"CF","F Gutierrez"]
["D Fister",null,56,1,4,"3B","J Lopez",null,4,"R Rowland-Smith",null,null,4,"3B","J Lopez"]
["R Rowland-Smith",null,19,1,5,"DH","R Branyan",null,null,null,null,null,5,"DH","R Branyan"]
["D Pauley",null,53,2,6,"1B","C Kotchman",null,null,null,null,null,6,"1B","C Kotchman"]
{"$rows_left_out":68}
{"sheet":"Marlins","index":16,"n_rows":73,"n_cols":406,"rows_kept":73,"cut":false,"hidden":false,"merged":[]}
["PITCHERS",null,"Effectiveness","Stamina",1,"LF","C Coghlan",null,1,"J Johnson",null,null,1,"LF","C Coghlan"]
["J Johnson",null,72,1,2,"1B","G Sanchez",null,2,"A Sanchez",null,null,2,"1B","G Sanchez"]
["A Sanchez",null,51,1,3,"SS","H Ramirez",null,3,"C Volstad",null,null,3,"SS","H Ramirez"]
["C Volstad",null,44,1,4,"3B","J Cantu",null,4,"R Nolasco",null,null,4,"3B","J Cantu"]
["R Nolasco",null,56,1,5,"2B","D Uggla",null,null,null,null,null,5,"2B","D Uggla"]
["N Robertson",null,37,2,6,"C","R Paulino",null,null,null,null,null,6,"C","R Paulino"]
{"$rows_left_out":68}
{"sheet":"Mets","index":17,"n_rows":73,"n_cols":406,"rows_kept":73,"cut":false,"hidden":false,"merged":[]}
["PITCHERS",null,"Effectiveness","Stamina",1,"SS","J Reyes",null,1,"J Santana",null,null,1,"SS","J Reyes"]
["J Santana",null,66,1,2,"RF","A Pagan",null,2,"M Pelfrey",null,null,2,"RF","A Pagan"]
["M Pelfrey",null,48,1,3,"3B","D Wright",null,3,"R Dickey",null,null,3,"3B","D Wright"]
["R Dickey",null,65,1,4,"CF","C Beltran",null,4,"J Niese",null,null,4,"CF","C Beltran"]
["J Niese",null,40,1,5,"LF","J Bay",null,null,null,null,null,5,"LF","J Bay"]
["F Rodriguez",null,68,3,6,"1B","I Davis",null,null,null,null,null,6,"1B","I Davis"]
{"$rows_left_out":68}
{"sheet":"Nationals","index":18,"n_rows":73,"n_cols":406,"rows_kept":73,"cut":false,"hidden":false,"merged":[]}
["PITCHERS",null,"Effectiveness","Stamina",1,"CF","N Morgan",null,1,"L Hernandez",null,null,1,"CF","N Morgan"]
["L Hernandez",null,52,1,2,"2B","C Guzman",null,2,"J Lannan",null,null,2,"2B","C Guzman"]
["J Lannan",null,31,1,3,"3B","R Zimmerman",null,3,"C Stammen",null,null,3,"3B","R Zimmerman"]
["C Stammen",null,36,1,4,"1B","A Dunn",null,4,"L Atilano",null,null,4,"1B","A Dunn"]
["L Atilano",null,37,1,5,"LF","J Willingham",null,null,null,null,null,5,"LF","J Willingham"]
["S Olsen",null,38,2,6,"RF","M Morse",null,null,null,null,null,6,"RF","M Morse"]
{"$rows_left_out":68}
{"sheet":"Orioles","index":19,"n_rows":73,"n_cols":23,"rows_kept":73,"cut":false,"hidden":false,"merged":[]}
["PITCHERS",null,"Effectiveness","Stamina",1,"2B","B Roberts",null,1,"J Guthrie",null,null,1,"2B","B Roberts"]
["J Guthrie",null,67,1,2,"LF","F Pie",null,2,"K Millwood",null,null,2,"LF","F Pie"]
["K Millwood",null,35,1,3,"1B","T Wigginton",null,3,"B Matusz",null,null,3,"1B","T Wigginton"]
["B Matusz",null,51,1,4,"DH","L Scott",null,4,"B Bergeson",null,null,4,"DH","L Scott"]
["B Bergeson",null,42,1,5,"CF","A Jones",null,null,null,null,null,5,"CF","A Jones"]
["A Simon",null,33,3,6,"RF","N Markakis",null,null,null,null,null,6,"RF","N Markakis"]
{"$rows_left_out":68}
{"sheet":"Padres","index":20,"n_rows":73,"n_cols":23,"rows_kept":73,"cut":false,"hidden":false,"merged":[]}
["PITCHERS",null,"Effectiveness","Stamina",1,"2B","D Eckstein",null,1,"M Latos",null,null,1,"2B","D Eckstein"]
["M Latos",null,74,1,2,"3B","C Headley",null,2,"C Richard",null,null,2,"3B","C Headley"]
["C Richard",null,45,1,3,"1B","A Gonzalez",null,3,"J Garland",null,null,3,"1B","A Gonzalez"]
["J Garland",null,53,1,4,"LF","S Hairston",null,4,"W LeBlanc",null,null,4,"LF","S Hairston"]
["W LeBlanc",null,43,1,5,"C","Y Torrealba",null,null,null,null,null,5,"C","Y Torrealba"]
["H Bell",null,64,3,6,"RF","W Venable",null,null,null,null,null,6,"RF","W Venable"]
{"$rows_left_out":68}
{"sheet":"Phillies","index":21,"n_rows":73,"n_cols":23,"rows_kept":73,"cut":false,"hidden":false,"merged":[]}
["PITCHERS",null,"Effectiveness","Stamina",1,"CF","S Victorino",null,1,"R Halladay",null,null,1,"CF","S Victorino"]
["R Halladay",null,78,1,2,"3B","P Polanco",null,2,"C Hamels",null,null,2,"3B","P Polanco"]
["C Hamels",null,66,1,3,"2B","C Utley",null,3,"K Kendrick",null,null,3,"2B","C Utley"]
["K Kendrick",null,48,1,4,"1B","R Howard",null,4,"J Moyer",null,null,4,"1B","R Howard"]
["J Moyer",null,73,1,5,"LF","J Werth",null,null,null,null,null,5,"LF","J Werth"]
["B Lidge",null,61,3,6,"C","C Ruiz",null,null,null,null,null,6,"C","C Ruiz"]
{"$rows_left_out":68}
{"sheet":"Pirates","index":22,"n_rows":73,"n_cols":406,"rows_kept":73,"cut":false,"hidden":false,"merged":[]}
["PITCHERS",null,"Effectiveness","Stamina",1,"CF","A McCutchen",null,1,"P Maholm",null,null,1,"CF","A McCutchen"]
["P Maholm",null,30,1,2,"LF","J Tabata",null,2,"Z Duke",null,null,2,"LF","J Tabata"]
["Z Duke",null,22,1,3,"2B","N Walker",null,3,"J Karstens",null,null,3,"2B","N Walker"]
["J Karstens",null,45,1,4,"1B","G Jones",null,4,"R Ohlendorf",null,null,4,"1B","G Jones"]
["R Ohlendorf",null,47,1,5,"C","R Doumit",null,null,null,null,null,5,"C","R Doumit"]
["O Dotel",null,55,3,6,"3B","P Alvarez",null,null,null,null,null,6,"3B","P Alvarez"]
{"$rows_left_out":68}
{"sheet":"Rangers","index":23,"n_rows":73,"n_cols":23,"rows_kept":73,"cut":false,"hidden":false,"merged":[]}
["PITCHERS",null,"Effectiveness","Stamina",1,"SS","E Andrus",null,1,"C Lee",null,null,1,"SS","E Andrus"]
["C Lee",null,77,1,2,"3B","M Young",null,2,"C Wilson",null,null,2,"3B","M Young"]
["C Wilson",null,60,1,3,"CF","J Hamilton",null,3,"C Lewis",null,null,3,"CF","J Hamilton"]
["C Lewis",null,65,1,4,"DH","V Guerrero",null,4,"T Hunter",null,null,4,"DH","V Guerrero"]
["T Hunter",null,60,1,5,"LF","N Cruz",null,null,null,null,null,5,"LF","N Cruz"]
["N Feliz",null,93,3,6,"2B","I Kinsler",null,null,null,null,null,6,"2B","I Kinsler"]
{"$rows_left_out":68}
{"sheet":"Rays","index":24,"n_rows":73,"n_cols":23,"rows_kept":73,"cut":false,"hidden":false,"merged":[]}
["PITCHERS",null,"Effectiveness","Stamina",1,"SS","J Bartlett",null,1,"D Price",null,null,1,"SS","J Bartlett"]
["D Price",null,64,1,2,"CF","B Upton",null,2,"M Garza",null,null,2,"CF","B Upton"]
["M Garza",null,59,1,3,"LF","C Crawford",null,3,"J Shields",null,null,3,"LF","C Crawford"]
["J Shields",null,40,1,4,"3B","E Longoria",null,4,"J Niemann",null,null,4,"3B","E Longoria"]
["J Niemann",null,58,1,5,"1B","C Pena",null,null,null,null,null,5,"1B","C Pena"]
["R Soriano",null,100,3,6,"RF","B Zobrist",null,null,null,null,null,6,"RF","B Zobrist"]
{"$rows_left_out":68}
{"sheet":"RedSox","index":25,"n_rows":73,"n_cols":23,"rows_kept":73,"cut":false,"hidden":false,"merged":[]}
["PITCHERS",null,"Effectiveness","Stamina",1,"CF","M Scutaro",null,1,"J Lester",null,null,1,"CF","M Scutaro"]
["J Lester",null,63,1,2,"2B","D Pedroia",null,2,"J Lackey",null,null,2,"2B","D Pedroia"]
["J Lackey",null,44,1,3,"C","V Martinez",null,3,"C Buchholz",null,null,3,"C","V Martinez"]
["C Buchholz",null,63,1,4,"1B","K Youkilis",null,4,"D Matsuzaka",null,null,4,"1B","K Youkilis"]
["D Matsuzaka",null,48,1,5,"DH","D Ortiz",null,null,null,null,null,5,"DH","D Ortiz"]
["J Papelbon",null,57,3,6,"3B","A Beltre",null,null,null,null,null,6,"3B","A Beltre"]
{"$rows_left_out":68}
{"sheet":"Reds","index":26,"n_rows":73,"n_cols":23,"rows_kept":73,"cut":false,"hidden":false,"merged":[]}
["PITCHERS",null,"Effectiveness","Stamina",1,"2B","B Phillips",null,1,"B Arroyo",null,null,1,"2B","B Phillips"]
["B Arroyo",null,69,1,2,"SS","O Cabrera",null,2,"J Cueto",null,null,2,"SS","O Cabrera"]
["J Cueto",null,57,1,3,"1B","J Votto",null,3,"M Leake",null,null,3,"1B","J Votto"]
["M Leake",null,37,1,4,"3B","S Rolen",null,4,"H Bailey",null,null,4,"3B","S Rolen"]
["H Bailey",null,48,1,5,"LF","J Gomes",null,null,null,null,null,5,"LF","J Gomes"]
["F Cordero",null,43,3,6,"RF","J Bruce",null,null,null,null,null,6,"RF","J Bruce"]
{"$rows_left_out":68}
{"sheet":"Rockies","index":27,"n_rows":73,"n_cols":23,"rows_kept":73,"cut":false,"hidden":false,"merged":[]}
["PITCHERS",null,"Effectiveness","Stamina",1,"2B","J Herrera",null,1,"U Jimenez",null,null,1,"2B","J Herrera"]
["U Jimenez",null,68,1,2,"CF","D Fowler",null,2,"J Hammel",null,null,2,"CF","D Fowler"]
["J Hammel",null,46,1,3,"RF","C Gonzalez",null,3,"J Chacin",null,null,3,"RF","C Gonzalez"]
["J Chacin",null,57,1,4,"SS","T Tulowitzki",null,4,"J De La Rosa",null,null,4,"SS","T Tulowitzki"]
["J De La Rosa",null,53,1,5,"3B","M Mora",null,null,null,null,null,5,"3B","M Mora"]
["H Street",null,77,3,6,"1B","T Helton",null,null,null,null,null,6,"1B","T Helton"]
{"$rows_left_out":68}
{"sheet":"Royals","index":28,"n_rows":73,"n_cols":23,"rows_kept":73,"cut":false,"hidden":false,"merged":[]}
["PITCHERS",null,"Effectiveness","Stamina",1,"CF","D DeJesus",null,1,"Z Greinke",null,null,1,"CF","D DeJesus"]
["Z Greinke",null,60,1,2,"C","J Kendall",null,2,"K Davies",null,null,2,"C","J Kendall"]
["K Davies",null,31,1,3,"1B","B Butler",null,3,"B Chen",null,null,3,"1B","B Butler"]
["B Chen",null,48,1,4,"3B","W Betemit",null,4,"B Bannister",null,null,4,"3B","W Betemit"]
["B Bannister",null,25,1,5,"DH","K Ka'aihue",null,null,null,null,null,5,"DH","K Ka'aihue"]
["J Soria",null,77,3,6,"LF","A Gordon",null,null,null,null,null,6,"LF","A Gordon"]
{"$rows_left_out":68}
{"sheet":"Tigers","index":29,"n_rows":73,"n_cols":23,"rows_kept":73,"cut":false,"hidden":false,"merged":[]}
["PITCHERS",null,"Effectiveness","Stamina",1,"CF","A Jackson",null,1,"J Verlander",null,null,1,"CF","A Jackson"]
["J Verlander",null,67,1,2,"2B","W Rhymes",null,2,"M Scherzer",null,null,2,"2B","W Rhymes"]
["M Scherzer",null,59,1,3,"1B","M Cabrera",null,3,"J Bonderman",null,null,3,"1B","M Cabrera"]
["J Bonderman",null,41,1,4,"LF","B Boesch",null,4,"R Porcello",null,null,4,"LF","B Boesch"]
["R Porcello",null,46,1,5,"3B","J Peralta",null,null,null,null,null,5,"3B","J Peralta"]
["J Valverde",null,67,3,6,"RF","R Raburn",null,null,null,null,null,6,"RF","R Raburn"]
{"$rows_left_out":68}
{"sheet":"Twins","index":30,"n_rows":73,"n_cols":23,"rows_kept":73,"cut":false,"hidden":false,"merged":[]}
["PITCHERS",null,"Effectiveness","Stamina",1,"CF","D Span",null,1,"C Pavano",null,null,1,"CF","D Span"]
["C Pavano",null,64,1,2,"2B","O Hudson",null,2,"F Liriano",null,null,2,"2B","O Hudson"]
["F Liriano",null,58,1,3,"C","J Mauer",null,3,"S Baker",null,null,3,"C","J Mauer"]
["S Baker",null,51,1,4,"1B","J Morneau",null,4,"N Blackburn",null,null,4,"1B","J Morneau"]
["N Blackburn",null,41,1,5,"LF","D Young",null,null,null,null,null,5,"LF","D Young"]
["M Capps",null,65,3,6,"DH","J Thome",null,null,null,null,null,6,"DH","J Thome"]
{"$rows_left_out":68}
{"sheet":"WhiteSox","index":31,"n_rows":73,"n_cols":23,"rows_kept":73,"cut":false,"hidden":false,"merged":[]}
["PITCHERS",null,"Effectiveness","Stamina",1,"LF","J Pierre",null,1,"J Danks",null,null,1,"LF","J Pierre"]
["J Danks",null,62,1,2,"SS","A Ramirez",null,2,"M Buehrle",null,null,2,"SS","A Ramirez"]
["M Buehrle",null,45,1,3,"CF","A Rios",null,3,"G Floyd",null,null,3,"CF","A Rios"]
["G Floyd",null,48,1,4,"1B","P Konerko",null,4,"F Garcia",null,null,4,"1B","P Konerko"]
["F Garcia",null,48,1,5,"RF","A Jones",null,null,null,null,null,5,"RF","A Jones"]
["B Jenks",null,48,3,6,"C","A Pierzynski",null,null,null,null,null,6,"C","A Pierzynski"]
{"$rows_left_out":68}
{"sheet":"Yankees","index":32,"n_rows":73,"n_cols":23,"rows_kept":73,"cut":false,"hidden":false,"merged":[]}
["PITCHERS",null,"Effectiveness","Stamina",1,"SS","D Jeter",null,1,"C Sabathia",null,null,1,"SS","D Jeter"]
["C Sabathia",null,64,1,2,"RF","N Swisher",null,2,"A Burnett",null,null,2,"RF","N Swisher"]
["A Burnett",null,35,1,3,"1B","M Teixeira",null,3,"P Hughes",null,null,3,"1B","M Teixeira"]
["P Hughes",null,59,1,4,"3B","A Rodriguez",null,4,"A Pettitte",null,null,4,"3B","A Rodriguez"]
["A Pettitte",null,57,1,5,"2B","R Cano",null,null,null,null,null,5,"2B","R Cano"]
["M Rivera",null,97,3,6,"DH","M Thames",null,null,null,null,null,6,"DH","M Thames"]
{"$rows_left_out":68}
{"sheet":"Production","index":33,"n_rows":38,"n_cols":6,"rows_kept":38,"cut":false,"hidden":true,"merged":[]}
[]
[]
[]
[]
[]
[]
{"$rows_left_out":32}