{"text_format":"1","workbook":"xlsx","n_sheets":34,"sheets":["Field of Play","Game Info","Settings & Expansion","2004RedSox","2002Angels","2001Mariners","2001Dbacks","1998Yankees","1995Braves","1995Indians","1993BlueJays","1991Twins","1989Athletics","1986Mets","1985Royals","1984Tigers","1975Reds","1972Athletics","1971Pirates","1970Orioles","1969Mets","1968Tigers","1967Cardinals","1963Dodgers","1961Yankees","1955Dodgers","1954Giants","1948Indians","1941Yankees","1941RedSox","1935Tigers","1934Cardinals","1927Yankees","Production"],"not_rendered":{"charts":2,"images":12,"macros":1,"external_links":1,"defined_names":0,"comments":0,"pivot_tables":0},"unopened":[],"bounds":{"document_bytes":16777216,"sheet_cells":100000,"rows_first":2000,"rows_last":500,"rows_between":2000,"halvings":0,"cell_chars":16384,"cell_head_chars":4096},"cells_cut":0,"cells_raw":0,"read":"whole","date_system":"1900"}

{"sheet":"Field of Play","index":0,"n_rows":32,"n_cols":21,"rows_kept":32,"cut":false,"hidden":false,"merged":[[31,12,31,13],[3,16,3,19],[4,16,4,17],[5,16,5,17],[6,16,6,17],[8,16,8,17],[10,16,11,19],[14,16,14,19],[7,16,7,17]]}
[null,1,2,3,4,5,6,7,8,9,10,11,"R","H","E"]
[{"$f":"'Game Info'!B2","v":"1986Mets"},0,0,0,0,0,3,0,3,0,null,null,{"$f":"SUM(B2:L2)","v":6},{"$f":"'Game Info'!B7","v":12},{"$f":"'Game Info'!B9","v":0}]
[{"$f":"'Game Info'!B1","v":"1995Braves"},0,1,0,0,0,0,0,0,"X",null,null,{"$f":"SUM(B3:L3)","v":1},{"$f":"'Game Info'!B8","v":1},{"$f":"'Game Info'!B10","v":0}]
[null,null,null,null,null,null,null,null,null,null,null,null,null,null,null,null,"THE MATCH UP"]
[null,null,null,null,null,null,null,null,null,null,"Away",1,{"$f":"'Game Info'!O2","v":"CF"},{"$f":"'Game Info'!P2","v":"M Wilson"},{"$f":"IF('Game Info'!Q2=\"\",\"\",'Game Info'!Q2)","v":""},null,"Baseline Batting Average:",null,null,{"$f":"'Settings & Expansion'!D1","v":0.26100000000000001}]
[null,null,null,null,null,null,null,null,null,null,{"$f":"A2","v":"1986Mets"},2,{"$f":"'Game Info'!O3","v":"2B"},{"$f":"'Game Info'!P3","v":"W Backman"},{"$f":"IF('Game Info'!Q3=\"\",\"\",'Game Info'!Q3)","v":""},null,{"$f":"'Game Info'!C23&\" Contact Rating:\"","v":"G Carter Contact Rating:"},null,":",{"$f":"'Game Info'!D23","v":49}]
[null,null,null,null,null,null,null,null,null,null,null,3,{"$f":"'Game Info'!O4","v":"1B"},{"$f":"'Game Info'!P4","v":"K Hernandez"},{"$f":"IF('Game Info'!Q4=\"\",\"\",'Game Info'!Q4)","v":""},null,{"$f":"'Game Info'!C13&\" Effectiveness:\"","v":"M Wohlers Effectiveness:"},null,":",{"$f":"'Game Info'!D13","v":44}]
[null,null,null,null,null,null,null,null,null,null,null,4,{"$f":"'Game Info'!O5","v":"C"},{"$f":"'Game Info'!P5","v":"G Carter"},{"$f":"IF('Game Info'!Q5=\"\",\"\",'Game Info'!Q5)","v":"*"},null,{"$f":"IF(M32=\"Normal Depth\",\"Infield at Normal Depth\",\"Infield In\")","v":"Infield at Normal Depth"},null,":",{"$f":"IF(M32=\"Normal Depth\",0,50)","v":0},{"$f":"IF(OR(T9<0.21,T9>0.35),\"*\",\"\")","v":""}]
[null,null,null,null,null,null,null,null,null,null,null,5,{"$f":"'Game Info'!O6","v":"RF"},{"$f":"'Game Info'!P6","v":"D Strawberry"},{"$f":"IF('Game Info'!Q6=\"\",\"\",'Game Info'!Q6)","v":""},null,"Batter's Adjusted Average:",null,null,{"$f":"(IF(T5*1000+2*(T6-T7)<210,210,IF(T5*1000+2*(T6-T7)>350,IF(T6<101,350,T5*1000+2*(T6-T7)),T5*1000+2*(T6-T7))))/1000+T8/1000","v":0.27100000000000002}]
[null,null,null,null,null,null,null,null,null,null,null,6,{"$f":"'Game Info'!O7","v":"3B"},{"$f":"'Game Info'!P7","v":"R Knight"},{"$f":"IF('Game Info'!Q7=\"\",\"\",'Game Info'!Q7)","v":""}]
[null,null,null,null,null,null,null,null,null,null,null,7,{"$f":"'Game Info'!O8","v":"LF"},{"$f":"'Game Info'!P8","v":"L Dykstra"},{"$f":"IF('Game Info'!Q8=\"\",\"\",'Game Info'!Q8)","v":""},null,{"$f":"IF((T5+T6/1000-T7/1000+T8/1000)<0.21,\"*minimum batting average of .210\",IF(T9>0.35,\"*maximum batting average of .350 unless the batter is a .350+ hitter\",\"\"))","v":""}]
[null,null,null,null,null,null,null,null,null,null,null,8,{"$f":"'Game Info'!O9","v":"SS"},{"$f":"'Game Info'!P9","v":"R Santana"},{"$f":"IF('Game Info'!Q9=\"\",\"\",'Game Info'!Q9)","v":""}]
[null,null,null,null,null,null,null,null,null,null,null,9,{"$f":"'Game Info'!O10","v":"P"},{"$f":"'Game Info'!P10","v":"S Fernandez"},{"$f":"IF('Game Info'!Q10=\"\",\"\",'Game Info'!Q10)","v":""}]
[]
[null,null,null,null,null,null,null,null,null,null,null,null,"Pitching",{"$f":"'Game Info'!P12","v":"S Fernandez"},{"$f":"'Game Info'!T12","v":44},null,"ON THE BASES"]
[null,null,null,null,null,null,null,null,null,null,null,null,null,null,null,null,{"$f":"\"First Base: \"&IF('Game Info'!C24=\"\",\"      Empty\",\"      \"&'Game Info'!C24)","v":"First Base:       Empty"},null,{"$f":"IF('Game Info'!C24=\"\",\"\",\"Speed: \"&'Game Info'!F24)","v":""}]
[null,null,null,null,null,null,null,null,null,null,"Home",1,{"$f":"'Game Info'!F2","v":"CF"},{"$f":"'Game Info'!G2","v":"M Grissom"},{"$f":"IF('Game Info'!H2=\"\",\"\",'Game Info'!H2)","v":""},null,{"$f":"\"Second Base: \"&IF('Game Info'!C25=\"\",\"Empty\",'Game Info'!C25)","v":"Second Base: Empty"},null,{"$f":"IF('Game Info'!C25=\"\",\"\",\"Speed: \"&'Game Info'!F25)","v":""}]
[null,null,null,null,null,null,null,null,null,null,{"$f":"A3","v":"1995Braves"},2,{"$f":"'Game Info'!F3","v":"2B"},{"$f":"'Game Info'!G3","v":"M Lemke"},{"$f":"IF('Game Info'!H3=\"\",\"\",'Game Info'!H3)","v":""},null,{"$f":"\"Third Base:  \"&IF('Game Info'!C26=\"\",\"    Empty\",\"    \"&'Game Info'!C26)","v":"Third Base:      Empty"},null,{"$f":"IF('Game Info'!C26=\"\",\"\",\"Speed: \"&'Game Info'!F26)","v":""}]
[null,null,null,null,null,null,null,null,null,null,null,3,{"$f":"'Game Info'!F4","v":"3B"},{"$f":"'Game Info'!G4","v":"C Jones"},{"$f":"IF('Game Info'!H4=\"\",\"\",'Game Info'!H4)","v":""}]
[null,null,null,null,"Landis",null,null,null,null,null,null,4,{"$f":"'Game Info'!F5","v":"1B"},{"$f":"'Game Info'!G5","v":"F McGriff"},{"$f":"IF('Game Info'!H5=\"\",\"\",'Game Info'!H5)","v":"*"}]
[null,null,null,null,153,null,null,null,null,null,null,5,{"$f":"'Game Info'!F6","v":"RF"},{"$f":"'Game Info'!G6","v":"D Justice"},""]
[null,null,null,null,null,null,null,null,null,null,null,6,{"$f":"'Game Info'!F7","v":"LF"},{"$f":"'Game Info'!G7","v":"R Klesko"},{"$f":"IF('Game Info'!H7=\"\",\"\",'Game Info'!H7)","v":""}]
[null,null,null,null,null,null,null,null,null,null,null,7,{"$f":"'Game Info'!F8","v":"C"},{"$f":"'Game Info'!G8","v":"J Lopez"},{"$f":"IF('Game Info'!H8=\"\",\"\",'Game Info'!H8)","v":""}]
[null,null,null,null,null,null,null,null,null,null,null,8,{"$f":"'Game Info'!F9","v":"SS"},{"$f":"'Game Info'!G9","v":"R Belliard"},{"$f":"IF('Game Info'!H9=\"\",\"\",'Game Info'!H9)","v":""}]
[null,null,null,null,null,null,null,null,null,null,null,9,{"$f":"'Game Info'!F10","v":"P"},{"$f":"'Game Info'!G10","v":"M Wohlers"},{"$f":"IF('Game Info'!H10=\"\",\"\",'Game Info'!H10)","v":""}]
[]
[null,null,null,null,null,null,null,null,null,null,null,null,"Pitching",{"$f":"'Game Info'!G12","v":"M Wohlers"},{"$f":"'Game Info'!K12","v":44}]
[]
[null,null,null,null,null,null,null,null,null,null,null,"Outs",{"$f":"'Game Info'!B4","v":0}]
[null,null,null,null,null,null,null,null,null,null,null,"Inning",{"$f":"'Game Info'!B6","v":10},{"$f":"'Game Info'!C6","v":"Top"}]
[]
[null,null,null,null,null,null,null,null,null,null,null,null,"Normal Depth"]

{"sheet":"Game Info","index":1,"n_rows":46,"n_cols":22,"rows_kept":46,"cut":false,"hidden":false,"merged":[]}
["Home Team","1995Braves","Fielding",null,null,null,null,null,"Contact","Power","Speed","Def/Arm","Bunt",null,null,null,null,"Contact","Power","Speed","Def/Arm","Bunt"]
["Away Team","1986Mets",{"$f":"IF(C1=\"Batting\",\"Fielding\",\"Batting\")","v":"Batting"},null,"Home Lineup",{"$f":"INDIRECT(B1&\"!N1\")","v":"CF"},{"$f":"INDIRECT(B1&\"!O1\")","v":"M Grissom"},null,{"$f":"VLOOKUP(G2,INDIRECT($B$1&\"!A1:F100\"),3,FALSE)","v":46},{"$f":"VLOOKUP(G2,INDIRECT($B$1&\"!A1:F100\"),4,FALSE)","v":42},{"$f":"IFERROR(VLOOKUP(G2,INDIRECT($B$1&\"!A11:F100\"),5,FALSE),20)","v":75},{"$f":"IFERROR(VLOOKUP(G2,INDIRECT($B$1&\"!A1:F100\"),6,FALSE),0)","v":70},{"$f":"IF(VLOOKUP(G2,INDIRECT($B$1&\"!A1:G100\"),7,FALSE)=0,50,VLOOKUP(G2,INDIRECT($B$1&\"!A1:G100\"),7,FALSE))","v":70},"Away Lineup",{"$f":"INDIRECT(B2&\"!N1\")","v":"CF"},{"$f":"INDIRECT(B2&\"!O1\")","v":"M Wilson"},null,{"$f":"IFERROR(VLOOKUP(P2,INDIRECT($B$2&\"!A1:F100\"),3,FALSE),20)","v":66},{"$f":"IFERROR(VLOOKUP(P2,INDIRECT($B$2&\"!A1:F100\"),4,FALSE),20)","v":60},{"$f":"IFERROR(VLOOKUP(P2,INDIRECT($B$2&\"!A1:F100\"),5,FALSE),20)","v":70},{"$f":"IFERROR(VLOOKUP(P2,INDIRECT($B$2&\"!A1:F100\"),6,FALSE),0)","v":60},{"$f":"IF(VLOOKUP(P2,INDIRECT($B$2&\"!A1:G100\"),7,FALSE)=0,50,VLOOKUP(P2,INDIRECT($B$2&\"!A1:G100\"),7,FALSE))","v":65}]
[null,null,null,null,null,{"$f":"INDIRECT(B1&\"!N2\")","v":"2B"},{"$f":"INDIRECT(B1&\"!O2\")","v":"M Lemke"},null,{"$f":"VLOOKUP(G3,INDIRECT($B$1&\"!A1:F100\"),3,FALSE)","v":43},{"$f":"VLOOKUP(G3,INDIRECT($B$1&\"!A1:F100\"),4,FALSE)","v":39},60,20,70,null,{"$f":"INDIRECT(B2&\"!N2\")","v":"2B"},{"$f":"INDIRECT(B2&\"!O2\")","v":"W Backman"},null,81,47,65,{"$f":"IFERROR(VLOOKUP(P3,INDIRECT($B$2&\"!A1:F100\"),6,FALSE),0)","v":20},65]
["Outs",0,null,null,null,{"$f":"INDIRECT(B1&\"!N3\")","v":"3B"},{"$f":"INDIRECT(B1&\"!O3\")","v":"C Jones"},null,49,56,65,40,55,null,{"$f":"INDIRECT(B2&\"!N3\")","v":"1B"},{"$f":"INDIRECT(B2&\"!O3\")","v":"K Hernandez"},null,76,65,55,{"$f":"IFERROR(VLOOKUP(P4,INDIRECT($B$2&\"!A1:F100\"),6,FALSE),0)","v":20},40]
[null,null,null,null,null,{"$f":"INDIRECT(B1&\"!N4\")","v":"1B"},{"$f":"INDIRECT(B1&\"!O4\")","v":"F McGriff"},"*",57,63,40,20,30,null,{"$f":"INDIRECT(B2&\"!N4\")","v":"C"},{"$f":"INDIRECT(B2&\"!O4\")","v":"G Carter"},"*",49,63,55,{"$f":"IFERROR(VLOOKUP(P5,INDIRECT($B$2&\"!A1:F100\"),6,FALSE),0)","v":75},55]
["Inning",10,{"$f":"IF(C1=\"Fielding\",\"Top\",\"Bottom\")","v":"Top"},null,null,{"$f":"INDIRECT(B1&\"!N5\")","v":"RF"},{"$f":"INDIRECT(B1&\"!O5\")","v":"D Justice"},null,43,61,65,80,55,null,{"$f":"INDIRECT(B2&\"!N5\")","v":"RF"},{"$f":"INDIRECT(B2&\"!O5\")","v":"D Strawberry"},null,51,82,70,{"$f":"IFERROR(VLOOKUP(P6,INDIRECT($B$2&\"!A1:F100\"),6,FALSE),0)","v":70},40]
["Away Hits",12,null,null,null,{"$f":"INDIRECT(B1&\"!N6\")","v":"LF"},{"$f":"INDIRECT(B1&\"!O6\")","v":"R Klesko"},null,71,85,55,50,25,null,{"$f":"INDIRECT(B2&\"!N6\")","v":"3B"},{"$f":"INDIRECT(B2&\"!O6\")","v":"R Knight"},null,70,58,60,{"$f":"IFERROR(VLOOKUP(P7,INDIRECT($B$2&\"!A1:F100\"),6,FALSE),0)","v":20},50]
["Home Hits",1,null,null,null,{"$f":"INDIRECT(B1&\"!N7\")","v":"C"},{"$f":"INDIRECT(B1&\"!O7\")","v":"J Lopez"},null,74,65,45,55,40,null,{"$f":"INDIRECT(B2&\"!N7\")","v":"LF"},{"$f":"INDIRECT(B2&\"!O7\")","v":"L Dykstra"},null,69,64,75,65,65]
["Away Errors",0,null,null,null,{"$f":"INDIRECT(B1&\"!N8\")","v":"SS"},{"$f":"INDIRECT(B1&\"!O8\")","v":"R Belliard"},null,28,18,60,20,65,null,{"$f":"INDIRECT(B2&\"!N8\")","v":"SS"},{"$f":"INDIRECT(B2&\"!O8\")","v":"R Santana"},null,30,11,65,20,70]
["Home Errors",0,null,null,null,{"$f":"INDIRECT(B1&\"!N9\")","v":"P"},{"$f":"INDIRECT(B1&\"!O9\")","v":"M Wohlers"},null,{"$f":"IF(F10=\"P\",20,IFERROR(VLOOKUP(G10,INDIRECT($B$1&\"!A1:F100\"),3,FALSE),20))","v":20},{"$f":"IF(F10=\"P\",10,VLOOKUP(G10,INDIRECT($B$1&\"!A1:F100\"),4,FALSE))","v":10},{"$f":"IF(F10=\"P\",25,IFERROR(VLOOKUP(G10,INDIRECT($B$1&\"!A1:F100\"),5,FALSE),20))","v":25},{"$f":"IFERROR(VLOOKUP(G10,INDIRECT($B$1&\"!A1:F100\"),6,FALSE),0)","v":"LF"},{"$f":"IF(F10=\"P\",60,IF(VLOOKUP(G10,INDIRECT($B$1&\"!A1:G100\"),7,FALSE)=0,50,VLOOKUP(G10,INDIRECT($B$1&\"!A1:G100\"),7,FALSE)))","v":60},null,{"$f":"INDIRECT(B2&\"!N9\")","v":"P"},{"$f":"INDIRECT(B2&\"!O9\")","v":"S Fernandez"},null,{"$f":"IF(O10=\"P\",20,IFERROR(VLOOKUP(P10,INDIRECT($B$2&\"!A1:F100\"),3,FALSE),20))","v":20},{"$f":"IF(O10=\"P\",10,IFERROR(VLOOKUP(P10,INDIRECT($B$2&\"!A1:F100\"),4,FALSE),20))","v":10},{"$f":"IF(O10=\"P\",25,IFERROR(VLOOKUP(P10,INDIRECT($B$2&\"!A1:F100\"),5,FALSE),20))","v":25},{"$f":"IFERROR(VLOOKUP(P10,INDIRECT($B$2&\"!A1:F100\"),6,FALSE),0)","v":"RF"},{"$f":"IF(O10=\"P\",60,IF(VLOOKUP(P10,INDIRECT($B$2&\"!A1:G100\"),7,FALSE)=0,50,VLOOKUP(P10,INDIRECT($B$2&\"!A1:G100\"),7,FALSE)))","v":60}]
["Infield In?","N",{"$f":"IF(B11=\"N\",1.3,0.4)","v":1.3},null,null,null,null,null,"Effectiveness","Stamina","Total",null,null,null,null,null,null,"Effectiveness","Stamina","Total"]
[null,null,null,null,null,{"$f":"INDIRECT(B1&\"!N11\")","v":"P"},{"$f":"INDIRECT(B1&\"!O11\")","v":"M Wohlers"},null,{"$f":"IFERROR(VLOOKUP(G12,INDIRECT($B$1&\"!A1:F100\"),3,FALSE),10)","v":71},{"$f":"IFERROR(VLOOKUP(G12,INDIRECT($B$1&\"!A1:F100\"),4,FALSE),3)","v":3},{"$f":"IF(F12<>\"P\",0,IF(J12=1,IF(H13>24,IF(I12>50,50-(H13-24),I12-(H13-24)),I12),IF(J12=2,IF(H13>6,IF(I12>50,50-2*(H13-6),I12-2*(H13-6)),I12),IF(J12=3,IF(H13>3,IF(I12>50,50-3*(H13-3),I12-3*(H13-3)),I12),50))))","v":44},null,null,null,{"$f":"INDIRECT(B2&\"!N11\")","v":"P"},{"$f":"INDIRECT(B2&\"!O11\")","v":"S Fernandez"},null,{"$f":"IFERROR(VLOOKUP(P12,INDIRECT($B$2&\"!A1:F100\"),3,FALSE),10)","v":64},{"$f":"IFERROR(VLOOKUP(P12,INDIRECT($B$2&\"!A1:F100\"),4,FALSE),3)","v":1},{"$f":"IF(O12<>\"P\",0,IF(S12=1,IF(Q13>24,IF(R12>50,50-(Q13-24),R12-(Q13-24)),R12),IF(S12=2,IF(Q13>6,IF(R12>50,50-2*(Q13-6),R12-2*(Q13-6)),R12),IF(S12=3,IF(Q13>3,IF(R12>50,50-3*(Q13-3),R12-3*(Q13-3)),R12),50))))","v":44}]
["Fielding","P",{"$f":"IF($C$1=\"Batting\",INDIRECT(B2&\"!O11\"),INDIRECT(B1&\"!O11\"))","v":"M Wohlers"},{"$f":"IF(C1=\"Fielding\",VLOOKUP(C13,G12:K12,5,FALSE),VLOOKUP(C13,P12:T12,5,FALSE))","v":44},null,null,"Batters Faced",5,null,null,null,null,null,null,null,"Batters Faced",30]
[null,"C",{"$f":"IF($C$1=\"Batting\",VLOOKUP(B14,$O$2:$P$12,2,FALSE),VLOOKUP(B14,$F$2:$G$12,2,FALSE))","v":"J Lopez"},{"$f":"IF(C1=\"Fielding\",VLOOKUP(C14,G2:L10,6,FALSE),VLOOKUP(C14,P2:U10,6,FALSE))","v":55},null,"Mound visit?",null,null,null,null,null,null,null,null,"Mound visit?"]
[null,"1B","F McGriff"]
[null,"2B","M Lemke"]
[null,"3B","C Jones"]
[null,"SS","R Belliard"]
[null,"LF","R Klesko",{"$f":"IF(C1=\"Fielding\",VLOOKUP(C19,G2:L10,6,FALSE),VLOOKUP(C19,P2:U10,6,FALSE))","v":50},{"$f":"C19&\" (\"&D19&\")\"","v":"R Klesko (50)"}]
[null,"CF","M Grissom",{"$f":"IF(C1=\"Fielding\",VLOOKUP(C20,G2:L10,6,FALSE),VLOOKUP(C20,P2:U10,6,FALSE))","v":70},{"$f":"C20&\" (\"&D20&\")\"","v":"M Grissom (70)"}]
[null,"RF","D Justice",{"$f":"IF(C1=\"Fielding\",VLOOKUP(C21,G2:L10,6,FALSE),VLOOKUP(C21,P2:U10,6,FALSE))","v":80},"D Justice (80)"]
[null,null,null,"Contact","Power","Speed","Bunt","Speed +/-"]
[0,"At bat",{"$f":"IF(C1=\"Fielding\",INDEX(P:P,MATCH(\"*\",Q:Q,0)),INDEX(G:G,MATCH(\"*\",H:H,0)))","v":"G Carter"},{"$f":"IFERROR(VLOOKUP(C23,G2:K10,3,FALSE),0)+IFERROR(VLOOKUP(C23,P2:T10,3,FALSE),0)","v":49},{"$f":"IFERROR(VLOOKUP(C23,G2:K10,4,FALSE),0)+IFERROR(VLOOKUP(C23,P2:T10,4,FALSE),0)","v":63},{"$f":"IFERROR(VLOOKUP(C23,G2:K10,5,FALSE),0)+IFERROR(VLOOKUP(C23,P2:T10,5,FALSE),0)","v":55},{"$f":"IFERROR(VLOOKUP(C23,G2:M10,7,FALSE),0)+IFERROR(VLOOKUP(C23,P2:V10,7,FALSE),0)","v":55},{"$f":"F23-50","v":5}]
[1,"1st base",null,{"$f":"IFERROR(VLOOKUP(C24,G2:K10,3,FALSE),0)+IFERROR(VLOOKUP(C24,P2:T10,3,FALSE),0)","v":0},{"$f":"IFERROR(VLOOKUP(C24,G2:K10,4,FALSE),0)+IFERROR(VLOOKUP(C24,P2:T10,4,FALSE),0)","v":0},{"$f":"IFERROR(VLOOKUP(C24,G2:K10,5,FALSE),0)+IFERROR(VLOOKUP(C24,P2:T10,5,FALSE),0)","v":0},{"$f":"IFERROR(VLOOKUP(C24,G2:M10,7,FALSE),0)+IFERROR(VLOOKUP(C24,P2:V10,7,FALSE),0)","v":0},{"$f":"F24-50","v":-50}]
[2,"2nd base",null,{"$f":"IFERROR(VLOOKUP(C25,G2:K10,3,FALSE),0)+IFERROR(VLOOKUP(C25,P2:T10,3,FALSE),0)","v":0},{"$f":"IFERROR(VLOOKUP(C25,G2:K10,4,FALSE),0)+IFERROR(VLOOKUP(C25,P2:T10,4,FALSE),0)","v":0},{"$f":"IFERROR(VLOOKUP(C25,G2:K10,5,FALSE),0)+IFERROR(VLOOKUP(C25,P2:T10,5,FALSE),0)","v":0},{"$f":"IFERROR(VLOOKUP(C25,G2:M10,7,FALSE),0)+IFERROR(VLOOKUP(C25,P2:V10,7,FALSE),0)","v":0},{"$f":"F25-50","v":-50}]
[3,"3rd base",null,{"$f":"IFERROR(VLOOKUP(C26,G2:K10,3,FALSE),0)+IFERROR(VLOOKUP(C26,P2:T10,3,FALSE),0)","v":0},{"$f":"IFERROR(VLOOKUP(C26,G2:K10,4,FALSE),0)+IFERROR(VLOOKUP(C26,P2:T10,4,FALSE),0)","v":0},{"$f":"IFERROR(VLOOKUP(C26,G2:K10,5,FALSE),0)+IFERROR(VLOOKUP(C26,P2:T10,5,FALSE),0)","v":0},{"$f":"IFERROR(VLOOKUP(C26,G2:M10,7,FALSE),0)+IFERROR(VLOOKUP(C26,P2:V10,7,FALSE),0)","v":0},-50]
[]
[null,null,{"$f":"COUNTA(C23:C26)","v":1}]
[]
["Hit direction","right-center field",{"$f":"IF(B30=\"left field\",C19,IF(B30=\"left-center field\",C20,IF(B30=\"center field\",C20,IF(B30=\"right-center field\",C21,IF(B30=\"right field\",C21,\"\")))))","v":"D Justice"},{"$f":"VLOOKUP(C30,C13:D21,2,FALSE)","v":80},18]
[]
["Score difference",null,{"$f":"ABS('Field of Play'!M2-'Field of Play'!M3)","v":5}]
[]
["Out Player","second baseman"]
[]
[]
["Clear bases marker in B38"]
[null,1]
["Inning Over"]
[]
["Grounder scoring chances:",null,90]
[]
["Winning","1986Mets","1986Mets"]
["Losing","1995Braves","1995Braves"]
[]
["Scoring P","G McMichael"]

{"sheet":"Settings & Expansion","index":2,"n_rows":137,"n_cols":16,"rows_kept":137,"cut":false,"hidden":false,"merged":[[0,12,0,15],[0,0,0,2],[2,0,3,10],[44,0,45,10],[89,0,90,10]]}
["Baseline batting average:",null,null,0.26100000000000001,null,null,null,null,null,null,null,null,"Statistical Averages By Year"]
[null,null,null,null,null,null,null,null,null,null,null,null,"Year","Avg BA","Avg SLG%","WHIP"]
["GAME PLAY",null,null,null,null,null,null,null,null,null,null,null,2010,0.25750000000000001,0.40300000000000002,1.347]
[null,null,null,null,null,null,null,null,null,null,null,null,2009,0.26300000000000001,0.41849999999999998,1.3904999999999998]
[null,null,null,null,null,null,null,null,null,null,null,null,2008,0.26400000000000001,0.41649999999999998,1.391]
["Welcome to Will Morrison's Excel Baseball.  This page is designed to help with any game play questions that may come up.",null,null,null,null,null,null,null,null,null,null,null,2007,0.26850000000000002,0.42299999999999999,1.4064999999999999]
["I recommend using Excel's search function if there is something specific you are looking for.",null,null,null,null,null,null,null,null,null,null,null,2006,0.27,0.432,1.4085000000000001]
[null,null,null,null,null,null,null,null,null,null,null,null,2005,0.26500000000000001,0.41899999999999998,1.369]
["When the game starts, you will be prompted to select the teams that are playing.  After you do so, you will need to select the",null,null,null,null,null,null,null,null,null,null,null,2004,0.26650000000000001,0.42799999999999999,1.4009999999999998]
["starting pitchers.  If you are continuing a game in progress, just click the \"Continue Game\" button and the window will close.",null,null,null,null,null,null,null,null,null,null,null,2003,0.26450000000000001,0.42249999999999999,1.3835]
[null,null,null,null,null,null,null,null,null,null,null,null,2002,0.26150000000000001,0.41699999999999998,1.3759999999999999]
["The main button you will be using is the \"SWING!\" button.  This will prompt the pitcher to deliver the pitch and the event to",null,null,null,null,null,null,null,null,null,null,null,2001,0.26400000000000001,0.42649999999999999,1.3795000000000002]
["occur.  The other gameplay buttons on the \"Field of Play\" tab are \"Mound Visit\", \"Toggle Infield Depth\" and \"Game Options\".",null,null,null,null,null,null,null,null,null,null,null,2000,0.27100000000000002,0.4375,1.4695]
[null,null,null,null,null,null,null,null,null,null,null,null,1999,0.27150000000000002,0.434,1.4645000000000001]
["Mound Visit - This button allows the manager a chance to come settle down the pitcher.  Just as in real baseball, sometimes",null,null,null,null,null,null,null,null,null,null,null,1998,0.26650000000000001,0.42099999999999999,1.4049999999999998]
[null,"this is beneficial and sometimes it is detrimental.  Based on 50/50 odds, the pitcher will either react like he has",null,null,null,null,null,null,null,null,null,null,1997,0.26700000000000002,0.41899999999999998,1.4125000000000001]
[null,"pitched to fewer batters or more batters.",null,null,null,null,null,null,null,null,null,null,1996,0.26950000000000002,0.42649999999999999,1.44]
[null,null,null,null,null,null,null,null,null,null,null,null,1995,0.26650000000000001,0.41749999999999998,1.4215]
["Toggle Infield Depth - This button draws the infield in or moves them back.  If the infield is in, the defensive team will have a",null,null,null,null,null,null,null,null,null,null,null,1994,0.27,0.42449999999999999,1.4300000000000002]
[null,"better chance of gunning down a runner trying to score on a groundout.  However, the batter's batting average will",null,null,null,null,null,null,null,null,null,null,1993,0.26550000000000001,0.40349999999999997,1.3875]
[null,"increase by 50 points.  The infield depth is reset to normal after each play.",null,null,null,null,null,null,null,null,null,null,1992,0.2555,0.3765,1.325]
[null,null,null,null,null,null,null,null,null,null,null,null,1991,0.255,0.38400000000000001,1.3355000000000001]
["Game Options - This button will lead to a number of managerial options:",null,null,null,null,null,null,null,null,null,null,null,1990,0.25750000000000001,0.38550000000000001,1.3475000000000001]
[null,"Steal A Base",null,null,null,null,null,null,null,null,null,null,1989,0.2535,0.3745,1.3180000000000001]
[null,"Sacrifice Bunt",null,null,null,null,null,null,null,null,null,null,1988,0.2535,0.377,1.3039999999999998]
[null,"Issue an Intentional Walk",null,null,null,null,null,null,null,null,null,null,1987,0.26300000000000001,0.41449999999999998,1.3900000000000001]
[null,"Throw at the Batter",null,null,null,null,null,null,null,null,null,null,1986,0.25750000000000001,0.39400000000000002,1.3545]
[null,"Pinch Hit or Defensive Substitution",null,null,null,null,null,null,null,null,null,null,1985,0.25650000000000001,0.39,1.3420000000000001]
[null,"Call to the Bullpen",null,null,null,null,null,null,null,null,null,null,1984,0.25950000000000001,0.38350000000000001,1.3425]
[null,"Start a New Game",null,null,null,null,null,null,null,null,null,null,1983,0.26050000000000001,0.38850000000000001,1.349]
[null,"Link to www.mlb.com",null,null,null,null,null,null,null,null,null,null,1982,0.26100000000000001,0.38750000000000001,1.343]
[null,null,null,null,null,null,null,null,null,null,null,null,1981,0.2555,0.36849999999999999,1.3155000000000001]
[null,"To return to the game, click on the picture icon in the middle of the window.",null,null,null,null,null,null,null,null,null,null,1980,0.26400000000000001,0.38650000000000001,1.3534999999999999]
[null,null,null,null,null,null,null,null,null,null,null,null,1979,0.26550000000000001,0.39649999999999996,1.3725000000000001]
["The \"Field of Play\" tab (where the game is played) also has two other buttons.  The first is About The Designer, which is just a",null,null,null,null,null,null,null,null,null,null,null,1978,0.25750000000000001,0.3785,1.3340000000000001]
[null,"short bio about me and how to get a hold of me with any questions or comments.  The second is the Boss Button,",null,null,null,null,null,null,null,null,null,null,1977,0.26400000000000001,0.40050000000000002,1.3725000000000001]
[null,"which will close all the tabs except a new one called \"Production\" and has some data and a couple graphs that look",null,null,null,null,null,null,null,null,null,null,1976,0.2555,0.36099999999999999,1.3170000000000002]
[null,"look it could be business-related.  There is a button on that page all the way at the bottom that will take you back to",null,null,null,null,null,null,null,null,null,null,1975,0.25750000000000001,0.374,1.3610000000000002]
[null,"the game.",null,null,null,null,null,null,null,null,null,null,1974,0.25650000000000001,0.36899999999999999,1.343]
[null,null,null,null,null,null,null,null,null,null,null,null,1973,0.25650000000000001,0.3785,1.3505]
["Everything on the Game Info tab should not be adjusted during the game.  If changes are made and then saved, the game will",null,null,null,null,null,null,null,null,null,null,null,1972,0.24349999999999999,0.35399999999999998,1.2605]
[null,"not run correctly, so make sure you do not move things around.  It can be helpful to look at that page though and look",null,null,null,null,null,null,null,null,null,null,1971,0.2495,0.36499999999999999,1.2965]
[null,"at player ratings.",null,null,null,null,null,null,null,null,null,null,1970,0.254,0.38550000000000001,1.3559999999999999]
[null,null,null,null,null,null,null,null,null,null,null,null,1969,0.248,0.36899999999999999,1.319]
["NUMBER RATING EXPLANATION",null,null,null,null,null,null,null,null,null,null,null,1968,0.23649999999999999,0.34,1.1930000000000001]
[null,null,null,null,null,null,null,null,null,null,null,null,1967,0.24249999999999999,0.35699999999999998,1.238]
[null,null,null,null,null,null,null,null,null,null,null,null,1966,0.248,0.3765,1.258]
["If you would like to adjust ratings for a player, you may do so at any time but it has to be in the right place.  Each team has its own",null,null,null,null,null,null,null,null,null,null,null,1965,0.2455,0.3715,1.2675000000000001]
[null,"tab and that is where the changes need to be made.  To the right of each player, there are numbers listed for various",null,null,null,null,null,null,null,null,null,null,1964,0.2505,0.378,1.2799999999999998]
[null,"facets of the game.  Here is how each of these numbers affect the game:",null,null,null,null,null,null,null,null,null,null,1963,0.246,0.372,1.2585]
[null,null,null,null,null,null,null,null,null,null,null,null,1962,0.25800000000000001,0.39350000000000002,1.3605]
[null,"PITCHERS",null,null,null,null,null,null,null,null,null,null,1961,0.25900000000000001,0.4,1.3725000000000001]
[null,"1) Effectiveness - This measures how good a pitcher is by comparing their WHIP to the league average. Pitchers",null,null,null,null,null,null,null,null,null,null,1960,0.255,0.38800000000000001,1.343]
[null,null,"start with an effectiveness rating of 50. A WHIP of 0.80 is the high mark, earning 100 points. A WHIP of",null,null,null,null,null,null,null,null,null,1959,0.25650000000000001,0.39200000000000002,1.3494999999999999]
[null,null,"1.80 is the low mark, which would be an effectiveness rating of 0.  Any WHIP can be converted to a raw",null,null,null,null,null,null,null,null,null,1958,0.25800000000000001,0.39400000000000002,1.3494999999999999]
[null,null,"score by using the formula y = -90.909x + 172.7272.",null,null,null,null,null,null,null,null,null,1957,0.25750000000000001,0.39100000000000001,1.3445]
[null,"2) Stamina - This is more of a classification system than a true numerical ranking.  1 is for starting pitchers, 2 is for",null,null,null,null,null,null,null,null,null,null,1956,0.25800000000000001,0.39750000000000002,1.3875]
[null,null,"middle relievers and 3 is for short relievers.  Starters tire more slowly, middle relievers more quickly and",null,null,null,null,null,null,null,null,null,1955,0.25850000000000001,0.39400000000000002,1.393]
[null,null,"short relievers normally tire after one inning.",null,null,null,null,null,null,null,null,null,1954,0.26100000000000001,0.39,1.3980000000000001]
[null,null,null,null,null,null,null,null,null,null,null,null,1953,0.26400000000000001,0.39700000000000002,1.4135]
[null,"HITTERS",null,null,null,null,null,null,null,null,null,null,1952,0.253,0.3695,1.3534999999999999]
[null,"1) Contact - This number is derived from comparing a player's batting average to the league average of .261.  A",null,null,null,null,null,null,null,null,null,null,1951,0.26100000000000001,0.38550000000000001,1.4165000000000001]
[null,null,"batting average of exactly .261 earns a contact score of 50 and an average of .350 earns a 100 rating.",null,null,null,null,null,null,null,null,null,1950,0.26600000000000001,0.40150000000000002,1.48]
[null,null,"Any batting average can be converted to a raw score by the formula y = 561.7977x - 96.6292.",null,null,null,null,null,null,null,null,null,1949,0.26250000000000001,0.38400000000000001,1.46]
[null,null,"It will not change the players' ratings but you can adjust the standard in-game batting average at the top",null,null,null,null,null,null,null,null,null,1948,0.26350000000000001,0.38250000000000001,1.452]
[null,null,"of this page.  So if a batter and a pitcher have matching contact and effectiveness ratings, they will hit",null,null,null,null,null,null,null,null,null,1947,0.26050000000000001,0.377,1.4155]
[null,null,"the average at the top of the page.  The default setting is .261.  If a hitter has a contact score higher than",null,null,null,null,null,null,null,null,null,1946,0.25600000000000001,0.35949999999999999,1.3694999999999999]
[null,null,"the pitcher's effectiveness score by 10 points, then the hitter will hit .261 + .010 = .271 against that",null,null,null,null,null,null,null,null,null,1945,0.26,0.35499999999999998,1.377]
[null,null,"particular pitcher.",null,null,null,null,null,null,null,null,null,1944,0.26050000000000001,0.35799999999999998,1.3540000000000001]
[null,"2) Power - When the game generates a home run, a batter must also pass the power test.  The probability of hitting a",null,null,null,null,null,null,null,null,null,null,1943,0.2535,0.34399999999999997,1.331]
[null,null,"home run increases the higher power rating they have.  This number is calculated by taking their slugging",null,null,null,null,null,null,null,null,null,1942,0.253,0.35,1.3465]
[null,null,"percentage and comparing it to an approximate league average of .400.  A slugging percentage of .400",null,null,null,null,null,null,null,null,null,1941,0.26200000000000001,0.375,1.4155]
[null,null,"earns the player a power rating of 50 and a slugging percentage of .650 earns them a 100.  Any slugging",null,null,null,null,null,null,null,null,null,1940,0.26750000000000002,0.39149999999999996,1.4184999999999999]
[null,null,"percentage can be converted to a raw score by the formula y = 200x - 30.  The game randomly generates",null,null,null,null,null,null,null,null,null,1939,0.27550000000000002,0.39649999999999996,1.4590000000000001]
[null,null,"a number between 0 and 100 and if the hitter's power score is higher than that number, then the batter",null,null,null,null,null,null,null,null,null,1938,0.27400000000000002,0.39549999999999996,1.4744999999999999]
[null,null,"will hit a home run if the random number before had determined a deep drive.  If they do not pass the",null,null,null,null,null,null,null,null,null,1937,0.27650000000000002,0.39849999999999997,1.47]
[null,null,"power test, the batter will hit a double.",null,null,null,null,null,null,null,null,null,1936,0.28349999999999997,0.40349999999999997,1.51]
[null,"3) Speed - This number affects stolen bases and baserunning plays like scoring from second base on a single.",null,null,null,null,null,null,null,null,null,null,1935,0.27850000000000003,0.39650000000000002,1.4575]
[null,null,"This number is harder to quantify as good baserunners are not always the fastest.  Consider 50 average",null,null,null,null,null,null,null,null,null,1934,0.27900000000000003,0.39650000000000002,1.4649999999999999]
[null,null,"with 0 being Cecil Fielder and 100 being Rickey Henderson.",null,null,null,null,null,null,null,null,null,1933,0.26950000000000002,0.376,1.3845000000000001]
[null,"4) Arm - The arm rating really only affects outfielders and catchers.  Infielders do not have arm ratings as infield range",null,null,null,null,null,null,null,null,null,null,1932,0.27650000000000002,0.4,1.4305000000000001]
[null,null,"is taken into account into the hit probabilities.  I am hoping to fix this in later versions if I ever get around",null,null,null,null,null,null,null,null,null,1931,0.27800000000000002,0.39150000000000001,1.4415]
[null,null,"to it.  Just like speed, this is harder to quantify so it is kind of a judgment call.  Roberto Clemente would be",null,null,null,null,null,null,null,null,null,1930,0.29549999999999998,0.4345,1.5209999999999999]
[null,null,"100 and Johnny Damon would be a 20.  Similarly, Johnny Bench would be a 100 and Mike Piazza would",null,null,null,null,null,null,null,null,null,1929,0.28899999999999998,0.41649999999999998,1.494]
[null,null,"a 20 or so.  All players who are not catchers or outfielders should be listed as 20 so if they are put in those",null,null,null,null,null,null,null,null,null,1928,0.28100000000000003,0.39700000000000002,1.4264999999999999]
[null,null,"positions, they will perform poorly.  Don't set it equal to 0, no outfielder is completely inept.",null,null,null,null,null,null,null,null,null,1927,0.28399999999999997,0.39250000000000002,1.4279999999999999]
[null,"5) Bunt - This number is setting the percentage of time they can sacrifice successfully.  Bunt execution percentage is",null,null,null,null,null,null,null,null,null,null,1926,0.28050000000000003,0.38900000000000001,1.4235]
[null,null,"a stat I have never seen so use yout best judgment here as well.",null,null,null,null,null,null,null,null,null,1925,0.29199999999999998,0.41099999999999998,1.4969999999999999]
[null,null,null,null,null,null,null,null,null,null,null,null,1924,0.28649999999999998,0.39450000000000002,1.4390000000000001]
["EXPANSION",null,null,null,null,null,null,null,null,null,null,null,1923,0.28449999999999998,0.39150000000000001,1.4395]
[null,null,null,null,null,null,null,null,null,null,null,null,1922,0.28849999999999998,0.40100000000000002,1.4384999999999999]
[null,null,null,null,null,null,null,null,null,null,null,null,1921,0.29049999999999998,0.40249999999999997,1.4350000000000001]
["This workbook is not currently set up for the addition of other teams.  Adding other teams would require manual changes in the",null,null,null,null,null,null,null,null,null,null,null,1920,0.27649999999999997,0.372,1.3525]
["code.  If you want to take a crack at adding new teams, go for it, just remember that the workbook is very particular about what",null,null,null,null,null,null,null,null,null,null,null,1919,0.26300000000000001,0.34799999999999998,1.272]
["data is going in what cells.  One number in the wrong place can cause the game to crash.  I am planning on adding other teams",null,null,null,null,null,null,null,null,null,null,null,1918,0.254,0.32500000000000001,1.2389999999999999]
["as new season gets played.  I am also interested in putting together a workbook of the greatest teams in baseball history.  If",null,null,null,null,null,null,null,null,null,null,null,1917,0.2485,0.32400000000000001,1.2105000000000001]
["there are modifications you would like to see or if you want to provide me a list of teams you would like to have in a workbook, ",null,null,null,null,null,null,null,null,null,null,null,1916,0.2475,0.32600000000000001,1.2170000000000001]
["please email me at will.e.morrison@gmail.com.",null,null,null,null,null,null,null,null,null,null,null,1915,0.248,0.32850000000000001,1.24]
[null,null,null,null,null,null,null,null,null,null,null,null,1914,0.2495,0.32850000000000001,1.2410000000000001]
[null,null,null,null,null,null,null,null,null,null,null,null,1913,0.25900000000000001,0.34499999999999997,1.2845]
[null,null,null,null,null,null,null,null,null,null,null,null,1912,0.26850000000000002,0.35849999999999999,1.3554999999999999]
[null,null,null,null,null,null,null,null,null,null,null,null,1911,0.26650000000000001,0.35699999999999998,1.3525]
[null,null,null,null,null,null,null,null,null,null,null,null,1910,0.2495,0.32550000000000001,1.2435]
[null,null,null,null,null,null,null,null,null,null,null,null,1909,0.24399999999999999,0.3115,1.1839999999999999]
[null,null,null,null,null,null,null,null,null,null,null,null,1908,0.23899999999999999,0.30499999999999999,1.137]
[null,null,null,null,null,null,null,null,null,null,null,null,1907,0.245,0.309,1.19]
[null,null,null,null,null,null,null,null,null,null,null,null,1906,0.2465,0.314,1.1955]
[null,null,null,null,null,null,null,null,null,null,null,null,1905,0.248,0.32300000000000001,1.2050000000000001]
[null,null,null,null,null,null,null,null,null,null,null,null,1904,0.2465,0.32150000000000001,1.1865000000000001]
[null,null,null,null,null,null,null,null,null,null,null,null,1903,0.26200000000000001,0.34649999999999997,1.2835000000000001]
[null,null,null,null,null,null,null,null,null,null,null,null,1902,0.26700000000000002,0.34350000000000003,1.3079999999999998]
[null,null,null,null,null,null,null,null,null,null,null,null,1901,0.27200000000000002,0.35949999999999999,1.3525]
[null,null,null,null,null,null,null,null,null,null,null,null,1900,0.27900000000000003,0.36599999999999999,1.4079999999999999]
[null,null,null,null,null,null,null,null,null,null,null,null,1899,0.28199999999999997,0.36599999999999999,1.43]
[null,null,null,null,null,null,null,null,null,null,null,null,1898,0.27100000000000002,0.34699999999999998,1.3819999999999999]
[null,null,null,null,null,null,null,null,null,null,null,null,1897,0.29199999999999998,0.38600000000000001,1.518]
[null,null,null,null,null,null,null,null,null,null,null,null,1896,0.28999999999999998,0.38700000000000001,1.526]
[null,null,null,null,null,null,null,null,null,null,null,null,1895,0.29599999999999999,0.4,1.59]
[null,null,null,null,null,null,null,null,null,null,null,null,1894,0.309,0.435,1.712]
[null,null,null,null,null,null,null,null,null,null,null,null,1893,0.28000000000000003,0.379,1.591]
[null,null,null,null,null,null,null,null,null,null,null,null,1892,0.245,0.32800000000000001,1.355]
[null,null,null,null,null,null,null,null,null,null,null,null,1891,0.252,0.34200000000000003,1.3979999999999999]
[null,null,null,null,null,null,null,null,null,null,null,null,1890,0.254,0.34200000000000003,1.4]
[null,null,null,null,null,null,null,null,null,null,null,null,1889,0.26600000000000001,0.36099999999999999,1.4550000000000001]
[null,null,null,null,null,null,null,null,null,null,null,null,1888,0.23899999999999999,0.32500000000000001,1.155]
[null,null,null,null,null,null,null,null,null,null,null,null,1887,0.26900000000000002,0.38100000000000001,1.391]
[null,null,null,null,null,null,null,null,null,null,null,null,1886,0.251,0.34200000000000003,1.2809999999999999]
[null,null,null,null,null,null,null,null,null,null,null,null,1885,0.24099999999999999,0.32200000000000001,1.2]
[null,null,null,null,null,null,null,null,null,null,null,null,1884,0.247,0.34,1.2290000000000001]
[null,null,null,null,null,null,null,null,null,null,null,null,1883,0.26200000000000001,0.36,1.2549999999999999]
[null,null,null,null,null,null,null,null,null,null,null,null,1882,0.251,0.34200000000000003,1.1879999999999999]
[null,null,null,null,null,null,null,null,null,null,null,null,1881,0.26,0.33800000000000002,1.23]
[null,null,null,null,null,null,null,null,null,null,null,null,1880,0.245,0.32,1.1080000000000001]
[null,null,null,null,null,null,null,null,null,null,null,null,1879,0.255,0.32900000000000001,1.1519999999999999]
[null,null,null,null,null,null,null,null,null,null,null,null,1878,0.25900000000000001,0.31900000000000001,1.1739999999999999]
[null,null,null,null,null,null,null,null,null,null,null,null,1877,0.27100000000000002,0.33800000000000002,1.25]
[null,null,null,null,null,null,null,null,null,null,null,null,1876,0.26500000000000001,0.32100000000000001,1.1970000000000001]

{"sheet":"2004RedSox","index":3,"n_rows":73,"n_cols":28,"rows_kept":73,"cut":false,"hidden":false,"merged":[[0,26,0,27]]}
["PITCHERS","WHIP","Effectiness","Stamina",1,"CF","J Damon",null,1,"C Schilling",null,null,1,"CF","J Damon",null,null,null,null,null,null,null,null,null,null,null,2004]
["C Schilling",1.0629999999999999,{"$f":"IF(B2=\"\",\"\",ROUND((50/($AB$11-$AB$10))*(B2-$AB$11)+100,0))","v":78},1,2,"2B","M Bellhorn",null,2,"P Martinez",null,null,2,"2B","M Bellhorn",null,null,null,null,null,null,null,null,null,null,null,"Avg BA (50)",{"$f":"VLOOKUP(AA1,'Settings & Expansion'!M3:P137,2,FALSE)","v":0.26650000000000001}]
["P Martinez",1.171,{"$f":"IF(B3=\"\",\"\",ROUND((50/($AB$11-$AB$10))*(B3-$AB$11)+100,0))","v":69},1,3,"LF","M Ramirez",null,3,"T Wakefield",null,null,3,"LF","M Ramirez",null,null,null,null,null,null,null,null,null,null,null,"Top BA (100)",0.372]
["T Wakefield",1.381,52,1,4,"DH","D Ortiz",null,4,"D Lowe",null,null,4,"DH","D Ortiz"]
["D Lowe",1.615,32,1,5,"C","J Varitek",null,null,null,null,null,5,"C","J Varitek"]
["K Foulke",0.94,88,3,6,"RF","T Nixon",null,null,null,null,null,6,"RF","T Nixon",null,null,null,null,null,null,null,null,null,null,null,"Avg Slg% (50)",{"$f":"VLOOKUP(AA1,'Settings & Expansion'!M3:P137,3,FALSE)","v":0.42799999999999999}]
["M Timlin",1.2310000000000001,64,3,7,"1B","K Millar",null,null,null,null,null,7,"1B","K Millar",null,null,null,null,null,null,null,null,null,null,null,"Top Slg% (100)",0.65700000000000003]
["A Embree",1.1459999999999999,71,3,8,"3B","B Mueller",null,null,null,null,null,8,"3B","B Mueller"]
["S Williamson",1.012,82,3,9,"SS","O Cabrera",null,null,null,null,null,9,"SS","O Cabrera"]
["C Leskanic",1.446,46,3,null,null,null,null,null,null,null,null,null,null,null,null,null,null,null,null,null,null,null,null,null,null,"Avg WHIP (50)",{"$f":"VLOOKUP(AA1,'Settings & Expansion'!M3:P137,4,FALSE)","v":1.4009999999999998}]
["B Arroyo",1.22,65,2,null,null,null,null,null,null,null,null,null,"P","C Schilling",null,null,null,null,null,null,null,null,null,null,null,"Low WHIP (100)",0.8]
["R Mendoza",1.0429999999999999,80,2]
["CATCHERS",null,"AVG","Slug%","Speed","Def/Arm","Bunt","Raw Avg","Raw Slg%",null,null,null,null,null,null,"IP","H","R","K","ERA",null,null,"BB"]
["J Varitek",null,{"$f":"IF(H14=\"\",\"\",ROUND((50/($AB$3-$AB$2))*(H14-$AB$3)+100,0))","v":64},{"$f":"IF(I14=\"\",\"\",ROUND((50/($AB$7-$AB$6))*(I14-$AB$7)+100,0))","v":62},40,55,60,0.29599999999999999,0.48199999999999998,null,null,null,null,"Starter","C Schilling",null,null,null,null,{"$f":"IFERROR(IF(O14=\"\",\"\",R14*9/P14),\"INF\")","v":"INF"}]
["D Mirabelli",null,{"$f":"IF(H15=\"\",\"\",ROUND((50/($AB$3-$AB$2))*(H15-$AB$3)+100,0))","v":57},{"$f":"IF(I15=\"\",\"\",ROUND((50/($AB$7-$AB$6))*(I15-$AB$7)+100,0))","v":71},25,50,45,0.28100000000000003,0.52500000000000002,null,null,null,null,null,null,null,null,null,null,""]
["INFIELDERS",null,"","",null,null,null,null,null,null,null,null,null,null,null,null,null,null,null,""]
["K Millar",null,64,60,55,40,40,0.29699999999999999,0.47399999999999998,null,null,null,null,null,null,null,null,null,null,""]
["M Bellhorn",null,49,53,60,20,50,0.26400000000000001,0.44400000000000001,null,null,null,null,null,null,null,null,null,null,""]
["P Reese",null,28,23,70,20,70,0.221,0.30299999999999999,null,null,null,null,null,null,null,null,null,null,""]
["B Mueller",null,58,54,55,20,65,0.28299999999999997,0.44600000000000001,null,null,null,null,null,null,null,null,null,null,""]
["K Youkilis",null,47,47,55,20,60,0.26,0.41299999999999998,null,null,null,null,null,null,null,null,null,null,{"$f":"IF(O21=\"\",\"\",R21*9/P21)","v":""}]
["N Garciaparra",null,76,66,65,20,65,0.32100000000000001,0.5,null,null,null,null,null,null,null,null,null,null,""]
["D Ortiz",null,66,88,30,20,25,0.30099999999999999,0.60299999999999998]
["O Cabrera",null,63,58,70,20,70,0.29399999999999998,0.46500000000000002]
["OUTFIELDERS",null,"",""]
["M Ramirez",null,70,90,45,45,30,0.308,0.61299999999999999]
["J Damon",null,68,61,75,40,75,0.30399999999999999,0.47699999999999998]
["G Kapler",null,53,42,60,65,45,0.27200000000000002,0.39]
["T Nixon",null,73,68,55,65,40,0.315,0.51]
[]
[]
[]
[]
[]
[]
[]
[]
[]
[]
[]
[]
[]
[null,null,"AB","H","RBI","Run","HR","3B","2B","SB"]
["PITCHERS",null,0,0,0,0,0,0,0,0]
["C Schilling",1,0,0,0,0,0,0,0,0]
["P Martinez",null,0,0,0,0,0,0,0,0]
["T Wakefield",null,0,0,0,0,0,0,0,0]
["D Lowe",null,0,0,0,0,0,0,0,0]
["K Foulke",null,0,0,0,0,0,0,0,0]
["M Timlin",null,0,0,0,0,0,0,0,0]
["A Embree",null,0,0,0,0,0,0,0,0]
["S Williamson",null,0,0,0,0,0,0,0,0]
["C Leskanic",null,0,0,0,0,0,0,0,0]
["B Arroyo",null,0,0,0,0,0,0,0,0]
["R Mendoza",null,0,0,0,0,0,0,0,0]
["CATCHERS",null,0,0,0,0,0,0,0,0]
["J Varitek",1,0,0,0,0,0,0,0,0]
["D Mirabelli",null,0,0,0,0,0,0,0,0]
["INFIELDERS",null,0,0,0,0,0,0,0,0]
["K Millar",1,0,0,0,0,0,0,0,0]
["M Bellhorn",1,0,0,0,0,0,0,0,0]
["P Reese",1,0,0,0,0,0,0,0,0]
["B Mueller",1,0,0,0,0,0,0,0,0]
["K Youkilis",null,0,0,0,0,0,0,0,0]
["N Garciaparra",null,0,0,0,0,0,0,0,0]
["D Ortiz",null,0,0,0,0,0,0,0,0]
["O Cabrera",1,0,0,0,0,0,0,0,0]
["OUTFIELDERS",1,0,0,0,0,0,0,0,0]
["M Ramirez",1,0,0,0,0,0,0,0,0]
["J Damon",1,0,0,0,0,0,0,0,0]
["G Kapler",null,0,0,0,0,0,0,0,0]
["T Nixon",null,0,0,0,0,0,0,0,0]
[null,99,0,0,0,0,0,0,0,0]

{"sheet":"2002Angels","index":4,"n_rows":73,"n_cols":406,"rows_kept":73,"cut":false,"hidden":false,"merged":[[0,26,0,27]]}
["PITCHERS","WHIP","Effectiveness","Stamina",1,"SS","D Eckstein",null,1,"J Washburn",null,null,1,"SS","D Eckstein",null,null,null,null,null,null,null,null,null,null,null,2002]
["J Washburn",1.175,{"$f":"IF(B2=\"\",\"\",ROUND((50/($AB$11-$AB$10))*(B2-$AB$11)+100,0))","v":69},1,2,"CF","D Erstad",null,2,"R Ortiz",null,null,2,"CF","D Erstad",null,null,null,null,null,null,null,null,null,null,null,"Avg BA (50)",{"$f":"VLOOKUP(AA1,'Settings & Expansion'!M3:P137,2,FALSE)","v":0.26150000000000001}]
["R Ortiz",1.1779999999999999,{"$f":"IF(B3=\"\",\"\",ROUND((50/($AB$11-$AB$10))*(B3-$AB$11)+100,0))","v":68},1,3,"RF","T Salmon",null,3,"K Appier",null,null,3,"RF","T Salmon",null,null,null,null,null,null,null,null,null,null,null,"Top BA (100)",0.34899999999999998]
["K Appier",1.3540000000000001,52,1,4,"LF","G Anderson",null,4,"J Lackey",null,null,4,"LF","G Anderson"]
["J Lackey",1.3480000000000001,53,1,5,"3B","T Glaus",null,null,null,null,null,5,"3B","T Glaus"]
["T Percival",1.1180000000000001,74,3,6,"DH","B Fullmer",null,null,null,null,null,6,"DH","B Fullmer",null,null,null,null,null,null,null,null,null,null,null,"Avg Slg% (50)",{"$f":"VLOOKUP(AA1,'Settings & Expansion'!M3:P137,3,FALSE)","v":0.41699999999999998}]
["S Schoeneweis",1.4239999999999999,46,2,7,"1B","S Spiezio",null,null,null,null,null,7,"1B","S Spiezio",null,null,null,null,null,null,null,null,null,null,null,"Top Slg% (100)",0.67700000000000005]
["B Weber",1.179,68,3,8,"C","B Molina",null,null,null,null,null,8,"C","B Molina"]
["A Levine",1.492,39,2,9,"2B","A Kennedy",null,null,null,null,null,9,"2B","A Kennedy",null,null,null,null,null,null,null,null,null,null,null,null,null,null,null,null,null,null,null,null,null,null,null,null,null,null,null,null,null,null,null,null,null,null,null,null,null,null,null,null,null,null,null,null,null,null,null,null,null,null,null,null,null,null,null,null,null,null,null,null,null,null,null,null,null,null,null,null,null,null,null,null,null,null,null,null,null,null,null,null,null,null,null,null,null,null,null,null,null,null,null,null,null,null,null,null,null,null,null,null,null,null,null,null,null,null,null,null,null,null,null,null,null,null,null,null,null,null,null,null,null,null,null,null,null,null,null,null,null,null,null,null,null,null,null,null,null,null,null,null,null,null,null,null,null,null,null,null,null,null,null,null,null,null,null,null,null,null,null,null,null,null,null,null,null,null,null,null,null,null,null,null,null,null,null,null,null,null,null,null,null,null,null,null,null,null,null,null,null,null,null,null,null,null,null,null,null,null,null,null,null,null,null,null,null,null,null,null,null,null,null,null,null,null,null,null,null,null,null,null,null,null,null,null,null,null,null,null,null,null,null,null,null,null,null,null,null,null,null,null,null,null,null,null,null,null,null,null,null,null,null,null,null,null,null,null,null,null,null,null,null,null,null,null,null,null,null,null,null,null,null,null,null,null,null,null,null,null,null,null,null,null,null,null,null,null,null,null,null,null,null,null,null,null,null,null,null,null,null,null,null,null,null,null,null,null,null,null,null,null,null,null,null,null,null,null,null,null,null,null,null,null,null,null,null,null,null,null,null,null,null,null,null,null,null,null,null,null,null,null,null,null,null,null,null,null,null,null,null,null,null,null,null,null,null,null,null,null,null,null,null,null,null,null,null,null,null,null,null,null,null,null,null,null,null,null,null,null,null,null,null,null,null,null,null,null,null,null,null,null,"D Brocail"]
["B Donnelly",1.0269999999999999,82,3,null,null,null,null,null,null,null,null,null,null,null,null,null,null,null,null,null,null,null,null,null,null,"Avg WHIP (50)",{"$f":"VLOOKUP(AA1,'Settings & Expansion'!M3:P137,4,FALSE)","v":1.3759999999999999}]
["A Sele",1.494,39,2,null,null,null,null,null,null,null,null,null,"P","J Washburn",null,null,null,null,null,null,null,null,null,null,null,"Low WHIP (100)",0.83299999999999996]
["F Rodriguez",0.88200000000000001,95,3,null,null,null,null,null,null,null,null,null,null,null,null,null,null,null,{"$f":"IF(O12=\"\",\"\",(9*R12)/P12)","v":""}]
["CATCHERS",null,"AVG","Slug%","Speed","Def/Arm","Bunt","Raw Avg","Raw Slg%",null,null,null,null,null,null,"IP","H","R","K","ERA",null,null,"BB"]
["B Molina",null,{"$f":"IF(H14=\"\",\"\",ROUND((50/($AB$3-$AB$2))*(H14-$AB$3)+100,0))","v":41},{"$f":"IF(I14=\"\",\"\",ROUND((50/($AB$7-$AB$6))*(I14-$AB$7)+100,0))","v":32},30,75,65,0.245,0.32200000000000001,null,null,null,null,"Starter","J Washburn",null,null,null,null,{"$f":"IFERROR(IF(O14=\"\",\"\",R14*9/P14),\"INF\")","v":"INF"},null,null,null,null,0,0]
["J Fobregas",null,{"$f":"IF(H15=\"\",\"\",ROUND((50/($AB$3-$AB$2))*(H15-$AB$3)+100,0))","v":11},{"$f":"IF(I15=\"\",\"\",ROUND((50/($AB$7-$AB$6))*(I15-$AB$7)+100,0))","v":9},40,60,60,0.193,0.20499999999999999,null,null,null,null,null,null,null,null,null,null,"",null,null,null,null,0,0]
["INFIELDERS",null,"","",null,null,null,null,null,null,null,null,null,null,null,null,null,null,null,"",null,null,null,null,0,0]
["S Spiezio",null,63,54,55,45,60,0.28499999999999998,0.436,null,null,null,null,null,null,null,null,null,null,""]
["A Kennedy",null,79,56,65,20,75,0.312,0.44900000000000001,null,null,null,null,null,null,null,null,null,null,""]
["D Eckstein",null,68,44,70,20,75,0.29299999999999998,0.38800000000000001,null,null,null,null,null,null,null,null,null,null,""]
["T Glaus",null,43,57,45,20,35,0.25,0.45300000000000001,null,null,null,null,null,null,null,null,null,null,""]
["B Fullmer",null,66,72,45,20,40,0.28899999999999998,0.53100000000000003,null,null,null,null,null,null,null,null,null,null,{"$f":"IF(O21=\"\",\"\",R21*9/P21)","v":""}]
["B Gil",null,63,53,60,20,60,0.28499999999999998,0.43099999999999999,null,null,null,null,null,null,null,null,null,null,""]
["J Nieves",null,66,29,60,20,60,0.28899999999999998,0.309]
["OUTFIELDERS",null,"",""]
["G Anderson",null,75,73,55,60,55,0.30599999999999999,0.53900000000000003]
["D Erstad",null,62,45,75,70,70,0.28299999999999997,0.38900000000000001]
["T Salmon",null,64,67,55,65,45,0.28599999999999998,0.503]
["O Palmeiro",null,72,38,65,60,65,0.3,0.35399999999999998]
["S Wooten",null,67,53,40,45,50,0.29199999999999998,0.43099999999999999]
[]
[]
[]
[]
[]
[]
[]
[]
[]
[]
[]
[]
[]
[null,null,"AB","H","RBI","Run","HR","3B","2B","SB"]
["PITCHERS",null,0,0,0,0,0,0,0,0]
["J Washburn",null,0,0,0,0,0,0,0,0]
["R Ortiz",1,0,0,0,0,0,0,0,0]
["K Appier",null,0,0,0,0,0,0,0,0]
["J Lackey",null,0,0,0,0,0,0,0,0]
["T Percival",null,0,0,0,0,0,0,0,0]
["S Schoeneweis",null,0,0,0,0,0,0,0,0]
["B Weber",null,0,0,0,0,0,0,0,0]
["A Levine",null,0,0,0,0,0,0,0,0]
["B Donnelly",null,0,0,0,0,0,0,0,0]
["A Sele",null,0,0,0,0,0,0,0,0]
["F Rodriguez",null,0,0,0,0,0,0,0,0]
["CATCHERS",null,0,0,0,0,0,0,0,0]
["B Molina",1,0,0,0,0,0,0,0,0]
["J Fobregas",null,0,0,0,0,0,0,0,0]
["INFIELDERS",null,0,0,0,0,0,0,0,0]
["S Spiezio",1,0,0,0,0,0,0,0,0]
["A Kennedy",1,0,0,0,0,0,0,0,0]
["D Eckstein",null,0,0,0,0,0,0,0,0]
["T Glaus",1,0,0,0,0,0,0,0,0]
["B Fullmer",1,0,0,0,0,0,0,0,0]
["B Gil",null,0,0,0,0,0,0,0,0]
["J Nieves",null,0,0,0,0,0,0,0,0]
["OUTFIELDERS",null,0,0,0,0,0,0,0,0]
["G Anderson",1,0,0,0,0,0,0,0,0]
["D Erstad",1,0,0,0,0,0,0,0,0]
["T Salmon",1,0,0,0,0,0,0,0,0]
["O Palmeiro",null,0,0,0,0,0,0,0,0]
["S Wooten",null,0,0,0,0,0,0,0,0]
[null,99,0,0,0,0,0,0,0,0]

{"sheet":"2001Mariners","index":5,"n_rows":73,"n_cols":28,"rows_kept":73,"cut":false,"hidden":false,"merged":[[0,26,0,27]]}
["PITCHERS","WHIP","Effectiveness","Stamina",1,"RF","I Suzuki",null,1,"J Moyer",null,null,1,"RF","I Suzuki",null,null,null,null,null,null,null,null,null,null,null,2001]
["J Moyer",1.1020000000000001,{"$f":"IF(B2=\"\",\"\",ROUND((50/($AB$11-$AB$10))*(B2-$AB$11)+100,0))","v":76},1,2,"LF","S Javier",null,2,"F Garcia",null,null,2,"LF","S Javier",null,null,null,null,null,null,null,null,null,null,null,"Avg BA (50)",{"$f":"VLOOKUP(AA1,'Settings & Expansion'!M3:P137,2,FALSE)","v":0.26400000000000001}]
["F Garcia",1.123,{"$f":"IF(B3=\"\",\"\",ROUND((50/($AB$11-$AB$10))*(B3-$AB$11)+100,0))","v":74},1,3,"2B","B Boone",null,3,"A Sele",null,null,3,"2B","B Boone",null,null,null,null,null,null,null,null,null,null,null,"Top BA (100)",0.35]
["A Sele",1.242,63,1,4,"DH","E Martinez",null,4,"P Abbott",null,null,4,"DH","E Martinez"]
["P Abbott",1.423,46,1,5,"1B","J Olerud",null,null,null,null,null,5,"1B","J Olerud"]
["K Sasaki",0.88500000000000001,97,3,6,"CF","M Cameron",null,null,null,null,null,6,"CF","M Cameron",null,null,null,null,null,null,null,null,null,null,null,"Avg Slg% (50)",{"$f":"VLOOKUP(AA1,'Settings & Expansion'!M3:P137,3,FALSE)","v":0.42649999999999999}]
["A Rhodes",0.85299999999999998,100,3,7,"C","D Wilson",null,null,null,null,null,7,"C","D Wilson",null,null,null,null,null,null,null,null,null,null,null,"Top Slg% (100)",0.66200000000000003]
["J Paniagua",1.47,41,3,8,"3B","D Bell",null,null,null,null,null,8,"3B","D Bell"]
["J Nelson",1.133,73,3,9,"SS","M McLemore",null,null,null,null,null,9,"SS","M McLemore"]
["N Charlton",0.98599999999999999,87,3,null,null,null,null,null,null,null,null,null,null,null,null,null,null,null,null,null,null,null,null,null,null,"Avg WHIP (50)",{"$f":"VLOOKUP(AA1,'Settings & Expansion'!M3:P137,4,FALSE)","v":1.3795000000000002}]
["J Halama",1.4319999999999999,45,2,null,null,null,null,null,null,null,null,null,"P","K Sasaki",null,null,null,null,null,null,null,null,null,null,null,"Low WHIP (100)",0.85299999999999998]
["J Pineiro",0.94199999999999995,92,2]
["CATCHERS",null,"AVG","Slug%","Speed","Def/Arm","Bunt","Raw Avg","Raw Slg%",null,null,null,null,null,null,"IP","H","R","K","ERA",null,null,"BB"]
["D Wilson",null,{"$f":"IF(H14=\"\",\"\",ROUND((50/($AB$3-$AB$2))*(H14-$AB$3)+100,0))","v":51},{"$f":"IF(I14=\"\",\"\",ROUND((50/($AB$7-$AB$6))*(I14-$AB$7)+100,0))","v":45},45,60,65,0.26500000000000001,0.40300000000000002,null,null,null,null,"Starter","A Sele",{"$f":"ROUND(7.66666666666666,2)","v":7.67},8,3,6,{"$f":"ROUND(3.52020860495437,2)","v":3.52},"W",null,0,0,0,0]
["T Lampkin",null,{"$f":"IF(H15=\"\",\"\",ROUND((50/($AB$3-$AB$2))*(H15-$AB$3)+100,0))","v":27},{"$f":"IF(I15=\"\",\"\",ROUND((50/($AB$7-$AB$6))*(I15-$AB$7)+100,0))","v":33},40,55,55,0.22500000000000001,0.34799999999999998,null,null,null,null,null,"J Nelson",{"$f":"ROUND(0.333333333333333,2)","v":0.33},0,0,1,{"$f":"ROUND(0,2)","v":0},null,null,0,0,0,0]
["INFIELDERS",null,"","",null,null,null,null,null,null,null,null,null,null,"K Sasaki",{"$f":"ROUND(1,2)","v":1},0,0,1,{"$f":"ROUND(0,2)","v":0},null,"S",0,0,0,0]
["J Olerud",null,72,60,40,20,45,0.30199999999999999,0.47199999999999998,null,null,null,null,null,null,null,null,null,null,{"$f":"IFERROR(IF(O17=\"\",\"\",R17*9/P17),\"INF\")","v":""}]
["B Boone",null,89,82,65,20,55,0.33100000000000002,0.57799999999999996,null,null,null,null,null,null,null,null,null,null,{"$f":"IFERROR(IF(O18=\"\",\"\",R18*9/P18),\"INF\")","v":""}]
["C Guillen",null,47,35,55,20,65,0.25900000000000001,0.35499999999999998,null,null,null,null,null,null,null,null,null,null,{"$f":"IFERROR(IF(O19=\"\",\"\",R19*9/P19),\"INF\")","v":""}]
["D Bell",null,48,48,60,20,60,0.26,0.41499999999999998,null,null,null,null,null,null,null,null,null,null,{"$f":"IFERROR(IF(O20=\"\",\"\",R20*9/P20),\"INF\")","v":""}]
["E Martinez",null,74,75,25,20,30,0.30599999999999999,0.54300000000000004,null,null,null,null,null,null,null,null,null,null,{"$f":"IF(O21=\"\",\"\",R21*9/P21)","v":""}]
["M McLemore",null,63,46,80,40,65,0.28599999999999998,0.40600000000000003,null,null,null,null,null,null,null,null,null,null,""]
["E Sprague",null,70,52,60,50,45,0.29799999999999999,0.436]
["OUTFIELDERS",null,"",""]
["A Martin",null,36,41,55,60,65,0.24,0.38200000000000001]
["M Cameron",null,52,61,75,90,55,0.26700000000000002,0.48]
["I Suzuki",null,100,56,90,90,85,0.35,0.45700000000000002]
["S Javier",null,66,42,65,65,70,0.29199999999999998,0.39100000000000001]
["J Buhner",null,26,44,45,75,30,0.222,0.4]
[]
[]
[]
[]
[]
[]
[]
[]
[]
[]
[]
[]
[]
[null,null,"AB","H","RBI","Run","HR","3B","2B","SB"]
["PITCHERS",null,0,0,0,0,0,0,0,0]
["J Moyer",null,0,0,0,0,0,0,0,0]
["F Garcia",null,0,0,0,0,0,0,0,0]
["A Sele",1,0,0,0,0,0,0,0,0]
["P Abbott",null,0,0,0,0,0,0,0,0]
["K Sasaki",1,0,0,0,0,0,0,0,0]
["A Rhodes",null,0,0,0,0,0,0,0,0]
["J Paniagua",null,0,0,0,0,0,0,0,0]
["J Nelson",1,0,0,0,0,0,0,0,0]
["N Charlton",null,0,0,0,0,0,0,0,0]
["J Halama",null,0,0,0,0,0,0,0,0]
["J Pineiro",null,0,0,0,0,0,0,0,0]
["CATCHERS",null,0,0,0,0,0,0,0,0]
["D Wilson",1,4,2,1,0,0,0,0,0]
["T Lampkin",null,0,0,0,0,0,0,0,0]
["INFIELDERS",null,0,0,0,0,0,0,0,0]
["J Olerud",1,4,2,4,1,1,0,0,0]
["B Boone",1,3,1,0,2,0,0,1,0]
["C Guillen",null,0,0,0,0,0,0,0,0]
["D Bell",1,4,1,0,0,0,1,0,0]
["E Martinez",1,3,1,0,1,0,0,1,0]
["M McLemore",1,2,0,0,0,0,0,0,0]
["E Sprague",null,0,0,0,0,0,0,0,0]
["OUTFIELDERS",null,0,0,0,0,0,0,0,0]
["A Martin",null,0,0,0,0,0,0,0,0]
["M Cameron",1,3,1,1,1,0,0,1,0]
["I Suzuki",1,3,0,0,1,0,0,0,1]
["S Javier",1,4,0,0,0,0,0,0,0]
["J Buhner",null,0,0,0,0,0,0,0,0]
[null,99,0,0,0,0,0,0,0,0]

{"sheet":"2001Dbacks","index":6,"n_rows":73,"n_cols":28,"rows_kept":73,"cut":false,"hidden":false,"merged":[[0,26,0,27]]}
["PITCHERS","WHIP","Effectiveness","Stamina",1,"SS","T Womack",null,1,"C Schilling",null,null,1,"SS","T Womack",null,null,null,null,null,null,null,null,null,null,null,2001]
["C Schilling",1.075,{"$f":"IF(B2=\"\",\"\",ROUND((50/($AB$11-$AB$10))*(B2-$AB$11)+100,0))","v":79},1,2,"2B","C Counsell",null,2,"R Johnson",null,null,2,"2B","C Counsell",null,null,null,null,null,null,null,null,null,null,null,"Avg BA (50)",{"$f":"VLOOKUP(AA1,'Settings & Expansion'!M3:P137,2,FALSE)","v":0.26400000000000001}]
["R Johnson",1.0089999999999999,{"$f":"IF(B3=\"\",\"\",ROUND((50/($AB$11-$AB$10))*(B3-$AB$11)+100,0))","v":85},1,3,"LF","L Gonzalez",null,3,"B Anderson",null,null,3,"LF","L Gonzalez",null,null,null,null,null,null,null,null,null,null,null,"Top BA (100)",0.35]
["B Anderson",1.395,49,1,4,"3B","M Williams",null,4,"A Lopez",null,null,4,"3B","M Williams"]
["A Lopez",1.21,66,1,5,"CF","S Finley",null,null,null,null,null,5,"CF","S Finley"]
["B Kim",1.0409999999999999,82,3,6,"RF","D Bautista",null,null,null,null,null,6,"RF","D Bautista",null,null,null,null,null,null,null,null,null,null,null,"Avg Slg% (50)",{"$f":"VLOOKUP(AA1,'Settings & Expansion'!M3:P137,3,FALSE)","v":0.42649999999999999}]
["M Batista",1.242,63,2,7,"1B","M Grace",null,null,null,null,null,7,"1B","M Grace",null,null,null,null,null,null,null,null,null,null,null,"Top Slg% (100)",0.66200000000000003]
["G Swindell",1.099,77,3,8,"C","D Miller",null,null,null,null,null,8,"C","D Miller"]
["T Brohawn",1.581,31,3,9,"P","C Schilling",null,null,null,null,null,9,"P","C Schilling"]
["B Prinz",1.268,61,3,null,null,null,null,null,null,null,null,null,null,null,null,null,null,null,null,null,null,null,null,null,null,"Avg WHIP (50)",{"$f":"VLOOKUP(AA1,'Settings & Expansion'!M3:P137,4,FALSE)","v":1.3795000000000002}]
["E Sabel",1.3440000000000001,53,3,null,null,null,null,null,null,null,null,null,"P","C Schilling",null,null,null,null,null,null,null,null,null,null,null,"Low WHIP (100)",0.85299999999999998]
["R Ellis",1.522,36,2]
["CATCHERS",null,"Contact","Power","Speed","Def/Arm","Bunt","Raw Avg","Raw Slg%",null,null,null,null,null,null,"IP","H","R","K","ERA",null,null,"BB"]
["D Miller",null,{"$f":"IF(H14=\"\",\"\",ROUND((50/($AB$3-$AB$2))*(H14-$AB$3)+100,0))","v":54},{"$f":"IF(I14=\"\",\"\",ROUND((50/($AB$7-$AB$6))*(I14-$AB$7)+100,0))","v":49},50,65,55,0.27100000000000002,0.42399999999999999,null,null,null,null,"Starter","C Schilling",null,null,null,null,{"$f":"IFERROR(IF(O14=\"\",\"\",R14*9/P14),\"INF\")","v":"INF"}]
["R Barajas",null,{"$f":"IF(H15=\"\",\"\",ROUND((50/($AB$3-$AB$2))*(H15-$AB$3)+100,0))","v":-10},{"$f":"IF(I15=\"\",\"\",ROUND((50/($AB$7-$AB$6))*(I15-$AB$7)+100,0))","v":18},35,60,55,0.16,0.27400000000000002,null,null,null,null,null,null,null,null,null,null,""]
["INFIELDERS",null,"","",null,null,null,null,null,null,null,null,null,null,null,null,null,null,null,""]
["M Grace",null,70,58,45,20,55,0.29799999999999999,0.46600000000000003,null,null,null,null,null,null,null,null,null,null,""]
["J Bell",null,41,44,60,20,65,0.248,0.4,null,null,null,null,null,null,null,null,null,null,""]
["T Womack",null,51,33,75,20,70,0.26600000000000001,0.34499999999999997,null,null,null,null,null,null,null,null,null,null,""]
["M Williams",null,56,58,45,20,40,0.27500000000000002,0.46600000000000003,null,null,null,null,null,null,null,null,null,null,""]
["C Counsell",null,56,36,70,20,75,0.27500000000000002,0.36199999999999999,null,null,null,null,null,null,null,null,null,null,{"$f":"IF(O21=\"\",\"\",R21*9/P21)","v":""}]
["E Durazo",null,53,73,45,20,35,0.26900000000000002,0.53700000000000003,null,null,null,null,null,null,null,null,null,null,""]
["J Spivey",null,47,49,70,20,65,0.25800000000000001,0.42299999999999999]
["OUTFIELDERS",null,"",""]
["L Gonzalez",null,85,106,55,55,40,0.32500000000000001,0.68799999999999994]
["S Finley",null,56,51,65,65,65,0.27500000000000002,0.43]
["R Sanders",null,49,76,60,60,45,0.26300000000000001,0.54900000000000004]
["D Delucci",null,57,61,45,55,40,0.27600000000000002,0.47899999999999998]
["D Bautista",null,72,52,65,65,60,0.30199999999999999,0.437]
[]
[]
[]
[]
[]
[]
[]
[]
[]
[]
[]
[]
[]
[null,null,"AB","H","RBI","Run","HR","3B","2B","SB"]
["PITCHERS",null,0,0,0,0,0,0,0,0]
["C Schilling",1,0,0,0,0,0,0,0,0]
["R Johnson",null,0,0,0,0,0,0,0,0]
["B Anderson",null,0,0,0,0,0,0,0,0]
["A Lopez",null,0,0,0,0,0,0,0,0]
["B Kim",null,0,0,0,0,0,0,0,0]
["M Batista",null,0,0,0,0,0,0,0,0]
["G Swindell",null,0,0,0,0,0,0,0,0]
["T Brohawn",null,0,0,0,0,0,0,0,0]
["B Prinz",null,0,0,0,0,0,0,0,0]
["E Sabel",null,0,0,0,0,0,0,0,0]
["R Ellis",null,0,0,0,0,0,0,0,0]
["CATCHERS",null,0,0,0,0,0,0,0,0]
["D Miller",1,0,0,0,0,0,0,0,0]
["R Barajas",null,0,0,0,0,0,0,0,0]
["INFIELDERS",null,0,0,0,0,0,0,0,0]
["M Grace",1,0,0,0,0,0,0,0,0]
["J Bell",null,0,0,0,0,0,0,0,0]
["T Womack",1,0,0,0,0,0,0,0,0]
["M Williams",1,0,0,0,0,0,0,0,0]
["C Counsell",1,0,0,0,0,0,0,0,0]
["E Durazo",1,0,0,0,0,0,0,0,0]
["J Spivey",null,0,0,0,0,0,0,0,0]
["OUTFIELDERS",null,0,0,0,0,0,0,0,0]
["L Gonzalez",1,0,0,0,0,0,0,0,0]
["S Finley",1,0,0,0,0,0,0,0,0]
["R Sanders",1,0,0,0,0,0,0,0,0]
["D Delucci",null,0,0,0,0,0,0,0,0]
["D Bautista",null,0,0,0,0,0,0,0,0]
[null,99,0,0,0,0,0,0,0,0]

{"sheet":"1998Yankees","index":7,"n_rows":73,"n_cols":406,"rows_kept":73,"cut":false,"hidden":false,"merged":[[0,26,0,27]]}
["PITCHERS","WHIP","Effectiveness","Stamina",1,"2B","C Knoblauch",null,1,"A Pettitte",null,null,1,"2B","C Knoblauch",null,null,null,null,null,null,null,null,null,null,null,1998]
["A Pettitte",1.4470000000000001,{"$f":"IF(B2=\"\",\"\",ROUND((50/($AB$11-$AB$10))*(B2-$AB$11)+100,0))","v":46},1,2,"SS","D Jeter",null,2,"D Wells",null,null,2,"SS","D Jeter",null,null,null,null,null,null,null,null,null,null,null,"Avg BA (50)",{"$f":"VLOOKUP(AA1,'Settings & Expansion'!M3:P137,2,FALSE)","v":0.26650000000000001}]
["D Wells",1.0449999999999999,{"$f":"IF(B3=\"\",\"\",ROUND((50/($AB$11-$AB$10))*(B3-$AB$11)+100,0))","v":82},1,3,"RF","P O'Neill",null,3,"D Cone",null,null,3,"RF","P O'Neill",null,null,null,null,null,null,null,null,null,null,null,"Top BA (100)",0.36299999999999999]
["D Cone",1.18,70,1,4,"CF","B Williams",null,4,"H Irabu",null,null,4,"CF","B Williams"]
["H Irabu",1.2949999999999999,60,1,5,"DH","C Davis",null,null,null,null,null,5,"DH","C Davis"]
["M Rivera",1.06,81,3,6,"1B","T Martinez",null,null,null,null,null,6,"1B","T Martinez",null,null,null,null,null,null,null,null,null,null,null,"Avg Slg% (50)",{"$f":"VLOOKUP(AA1,'Settings & Expansion'!M3:P137,3,FALSE)","v":0.42099999999999999}]
["R Mendoza",1.2350000000000001,65,2,7,"3B","S Brosius",null,null,null,null,null,7,"3B","S Brosius",null,null,null,null,null,null,null,null,null,null,null,"Top Slg% (100)",0.66500000000000004]
["M Stanton",1.228,66,3,8,"C","J Posada",null,null,null,null,null,8,"C","J Posada"]
["J Nelson",1.6359999999999999,29,3,9,"LF","C Curtis",null,null,null,null,null,9,"LF","C Curtis",null,null,null,null,null,null,null,null,null,null,null,null,null,null,null,null,null,null,null,null,null,null,null,null,null,null,null,null,null,null,null,null,null,null,null,null,null,null,null,null,null,null,null,null,null,null,null,null,null,null,null,null,null,null,null,null,null,null,null,null,null,null,null,null,null,null,null,null,null,null,null,null,null,null,null,null,null,null,null,null,null,null,null,null,null,null,null,null,null,null,null,null,null,null,null,null,null,null,null,null,null,null,null,null,null,null,null,null,null,null,null,null,null,null,null,null,null,null,null,null,null,null,null,null,null,null,null,null,null,null,null,null,null,null,null,null,null,null,null,null,null,null,null,null,null,null,null,null,null,null,null,null,null,null,null,null,null,null,null,null,null,null,null,null,null,null,null,null,null,null,null,null,null,null,null,null,null,null,null,null,null,null,null,null,null,null,null,null,null,null,null,null,null,null,null,null,null,null,null,null,null,null,null,null,null,null,null,null,null,null,null,null,null,null,null,null,null,null,null,null,null,null,null,null,null,null,null,null,null,null,null,null,null,null,null,null,null,null,null,null,null,null,null,null,null,null,null,null,null,null,null,null,null,null,null,null,null,null,null,null,null,null,null,null,null,null,null,null,null,null,null,null,null,null,null,null,null,null,null,null,null,null,null,null,null,null,null,null,null,null,null,null,null,null,null,null,null,null,null,null,null,null,null,null,null,null,null,null,null,null,null,null,null,null,null,null,null,null,null,null,null,null,null,null,null,null,null,null,null,null,null,null,null,null,null,null,null,null,null,null,null,null,null,null,null,null,null,null,null,null,null,null,null,null,null,null,null,null,null,null,null,null,null,null,null,null,null,null,null,null,null,null,null,null,null,null,null,null,null,null,null,null,null,null,null,null,null,null,null,null,"B Carlyle"]
["G Lloyd",0.85,100,3,null,null,null,null,null,null,null,null,null,null,null,null,null,null,null,null,null,null,null,null,null,null,"Avg WHIP (50)",{"$f":"VLOOKUP(AA1,'Settings & Expansion'!M3:P137,4,FALSE)","v":1.4049999999999998}]
["O Hernandez",1.17,71,2,null,null,null,null,null,null,null,null,null,"P","A Pettitte",null,null,null,null,null,null,null,null,null,null,null,"Low WHIP (100)",0.84899999999999998]
["D Holmes",1.3049999999999999,59,3]
["CATCHERS",null,"Contact","Power","Speed","Def/Arm","Bunt","Raw Avg","Raw Slg%",null,null,null,null,null,null,"IP","H","R","K","ERA",null,null,"BB"]
["J Posada",null,{"$f":"IF(H14=\"\",\"\",ROUND((50/($AB$3-$AB$2))*(H14-$AB$3)+100,0))","v":51},{"$f":"IF(I14=\"\",\"\",ROUND((50/($AB$7-$AB$6))*(I14-$AB$7)+100,0))","v":61},55,70,60,0.26800000000000002,0.47499999999999998,null,null,null,null,"Starter","A Pettitte",null,null,null,null,{"$f":"IFERROR(IF(O14=\"\",\"\",R14*9/P14),\"INF\")","v":"INF"},null,null,null,null,0,0]
["J Girardi",null,{"$f":"IF(H15=\"\",\"\",ROUND((50/($AB$3-$AB$2))*(H15-$AB$3)+100,0))","v":55},{"$f":"IF(I15=\"\",\"\",ROUND((50/($AB$7-$AB$6))*(I15-$AB$7)+100,0))","v":43},45,60,60,0.27600000000000002,0.38600000000000001,null,null,null,null,null,null,null,null,null,null,"",null,null,null,null,0,0]
["INFIELDERS",null,"","",null,null,null,null,null,null,null,null,null,null,null,null,null,null,null,"",null,null,null,null,0,0]
["T Martinez",null,58,67,50,20,35,0.28100000000000003,0.505,null,null,null,null,null,null,null,null,null,null,"",null,null,null,null,0,0]
["C Knoblauch",null,49,47,75,20,65,0.26500000000000001,0.40500000000000003,null,null,null,null,null,null,null,null,null,null,"",null,null,null,null,0,0]
["D Jeter",null,80,62,75,20,70,0.32400000000000001,0.48099999999999998,null,null,null,null,null,null,null,null,null,null,""]
["S Brosius",null,67,60,60,20,55,0.3,0.47199999999999998,null,null,null,null,null,null,null,null,null,null,""]
["L Sojo",null,32,18,60,20,65,0.23100000000000001,0.26500000000000001,null,null,null,null,null,null,null,null,null,null,{"$f":"IF(O21=\"\",\"\",R21*9/P21)","v":""}]
["C Davis",null,63,55,45,55,30,0.29099999999999998,0.44700000000000001,null,null,null,null,null,null,null,null,null,null,""]
["OUTFIELDERS",null,"",""]
["C Curtis",null,38,38,65,60,55,0.24299999999999999,0.36]
["B Williams",null,88,82,70,75,70,0.33900000000000002,0.57499999999999996]
["P O'Neill",null,76,68,60,60,30,0.317,0.51]
["D Strawberry",null,40,75,55,60,40,0.247,0.54200000000000004]
["T Raines",null,62,42,65,40,65,0.28999999999999998,0.38300000000000001]
["R Ledee",null,37,44,60,55,45,0.24099999999999999,0.39200000000000002]
[]
[]
[]
[]
[]
[]
[]
[]
[]
[]
[]
[]
[]
[null,null,"AB","H","RBI","Run","HR","3B","2B","SB"]
["PITCHERS",null,0,0,0,0,0,0,0,0]
["A Pettitte",1,0,0,0,0,0,0,0,0]
["D Wells",null,0,0,0,0,0,0,0,0]
["D Cone",null,0,0,0,0,0,0,0,0]
["H Irabu",null,0,0,0,0,0,0,0,0]
["M Rivera",null,0,0,0,0,0,0,0,0]
["R Mendoza",null,0,0,0,0,0,0,0,0]
["M Stanton",null,0,0,0,0,0,0,0,0]
["J Nelson",null,0,0,0,0,0,0,0,0]
["G Lloyd",null,0,0,0,0,0,0,0,0]
["O Hernandez",null,0,0,0,0,0,0,0,0]
["D Holmes",null,0,0,0,0,0,0,0,0]
["CATCHERS",null,0,0,0,0,0,0,0,0]
["J Posada",1,0,0,0,0,0,0,0,0]
["J Girardi",null,0,0,0,0,0,0,0,0]
["INFIELDERS",null,0,0,0,0,0,0,0,0]
["T Martinez",1,0,0,0,0,0,0,0,0]
["C Knoblauch",1,0,0,0,0,0,0,0,0]
["D Jeter",1,0,0,0,0,0,0,0,0]
["S Brosius",null,0,0,0,0,0,0,0,0]
["L Sojo",null,0,0,0,0,0,0,0,0]
["C Davis",1,0,0,0,0,0,0,0,0]
["OUTFIELDERS",null,0,0,0,0,0,0,0,0]
["C Curtis",null,0,0,0,0,0,0,0,0]
["B Williams",1,0,0,0,0,0,0,0,0]
["P O'Neill",null,0,0,0,0,0,0,0,0]
["D Strawberry",1,0,0,0,0,0,0,0,0]
["T Raines",null,0,0,0,0,0,0,0,0]
["R Ledee",1,0,0,0,0,0,0,0,0]
[null,99,0,0,0,0,0,0,0,0]

{"sheet":"1995Braves","index":8,"n_rows":73,"n_cols":406,"rows_kept":73,"cut":false,"hidden":false,"merged":[[0,26,0,27]]}
["PITCHERS","WHIP","Effectiveness","Stamina",1,"CF","M Grissom",null,1,"G Maddux",null,null,1,"CF","M Grissom",null,null,null,null,null,null,null,null,null,null,null,1995]
["G Maddux",0.81100000000000005,{"$f":"IF(B2=\"\",\"\",ROUND((50/($AB$11-$AB$10))*(B2-$AB$11)+100,0))","v":100},1,2,"2B","M Lemke",null,2,"T Glavine",null,null,2,"2B","M Lemke",null,null,null,null,null,null,null,null,null,null,null,"Avg BA (50)",{"$f":"VLOOKUP(AA1,'Settings & Expansion'!M3:P137,2,FALSE)","v":0.26650000000000001}]
["T Glavine",1.248,{"$f":"IF(B3=\"\",\"\",ROUND((50/($AB$11-$AB$10))*(B3-$AB$11)+100,0))","v":64},1,3,"3B","C Jones",null,3,"J Smoltz",null,null,3,"3B","C Jones",null,null,null,null,null,null,null,null,null,null,null,"Top BA (100)",0.36799999999999999]
["J Smoltz",1.2350000000000001,65,1,4,"1B","F McGriff",null,4,"S Avery",null,null,4,"1B","F McGriff"]
["S Avery",1.252,64,1,5,"RF","D Justice",null,null,null,null,null,5,"RF","D Justice"]
["M Wohlers",1.1599999999999999,71,3,6,"LF","R Klesko",null,null,null,null,null,6,"LF","R Klesko",null,null,null,null,null,null,null,null,null,null,null,"Avg Slg% (50)",{"$f":"VLOOKUP(AA1,'Settings & Expansion'!M3:P137,3,FALSE)","v":0.41749999999999998}]
["G McMichael",1.19,69,2,7,"C","J Lopez",null,null,null,null,null,7,"C","J Lopez",null,null,null,null,null,null,null,null,null,null,null,"Top Slg% (100)",0.69]
["B Clontz",1.3480000000000001,56,3,8,"SS","R Belliard",null,null,null,null,null,8,"SS","R Belliard"]
["P Borbon",1.4379999999999999,49,3,9,"P","G Maddux",null,null,null,null,null,9,"P","M Wohlers",null,null,null,null,null,null,null,null,null,null,null,null,null,null,null,null,null,null,null,null,null,null,null,null,null,null,null,null,null,null,null,null,null,null,null,null,null,null,null,null,null,null,null,null,null,null,null,null,null,null,null,null,null,null,null,null,null,null,null,null,null,null,null,null,null,null,null,null,null,null,null,null,null,null,null,null,null,null,null,null,null,null,null,null,null,null,null,null,null,null,null,null,null,null,null,null,null,null,null,null,null,null,null,null,null,null,null,null,null,null,null,null,null,null,null,null,null,null,null,null,null,null,null,null,null,null,null,null,null,null,null,null,null,null,null,null,null,null,null,null,null,null,null,null,null,null,null,null,null,null,null,null,null,null,null,null,null,null,null,null,null,null,null,null,null,null,null,null,null,null,null,null,null,null,null,null,null,null,null,null,null,null,null,null,null,null,null,null,null,null,null,null,null,null,null,null,null,null,null,null,null,null,null,null,null,null,null,null,null,null,null,null,null,null,null,null,null,null,null,null,null,null,null,null,null,null,null,null,null,null,null,null,null,null,null,null,null,null,null,null,null,null,null,null,null,null,null,null,null,null,null,null,null,null,null,null,null,null,null,null,null,null,null,null,null,null,null,null,null,null,null,null,null,null,null,null,null,null,null,null,null,null,null,null,null,null,null,null,null,null,null,null,null,null,null,null,null,null,null,null,null,null,null,null,null,null,null,null,null,null,null,null,null,null,null,null,null,null,null,null,null,null,null,null,null,null,null,null,null,null,null,null,null,null,null,null,null,null,null,null,null,null,null,null,null,null,null,null,null,null,null,null,null,null,null,null,null,null,null,null,null,null,null,null,null,null,null,null,null,null,null,null,null,null,null,null,null,null,null,null,null,null,null,null,null,null,null,null,null,null,"M Wohlers"]
["S Bedrosian",1.857,14,3,null,null,null,null,null,null,null,null,null,null,null,null,null,null,null,null,null,null,null,null,null,null,"Avg WHIP (50)",{"$f":"VLOOKUP(AA1,'Settings & Expansion'!M3:P137,4,FALSE)","v":1.4215}]
["K Mercker",1.4059999999999999,51,2,null,null,null,null,null,null,null,null,null,"P","M Wohlers",null,null,null,null,null,null,null,null,null,null,null,"Low WHIP (100)",0.81100000000000005]
["M Stanton",1.9139999999999999,10,2]
["CATCHERS",null,"Contact","Power","Speed","Def/Arm","Bunt","Raw Avg","Raw Slg%",null,null,null,null,null,null,"IP","H","R","K","ERA",null,null,"BB"]
["J Lopez",null,{"$f":"IF(H14=\"\",\"\",ROUND((50/($AB$3-$AB$2))*(H14-$AB$3)+100,0))","v":74},{"$f":"IF(I14=\"\",\"\",ROUND((50/($AB$7-$AB$6))*(I14-$AB$7)+100,0))","v":65},45,55,40,0.315,0.498,null,null,null,null,"Starter","T Glavine",{"$f":"ROUND(7,2)","v":7},9,4,2,{"$f":"ROUND(5.14285714285714,2)","v":5.14},"L",null,1,0,0,0]
["C O'Brien",null,{"$f":"IF(H15=\"\",\"\",ROUND((50/($AB$3-$AB$2))*(H15-$AB$3)+100,0))","v":31},{"$f":"IF(I15=\"\",\"\",ROUND((50/($AB$7-$AB$6))*(I15-$AB$7)+100,0))","v":47},35,60,55,0.22700000000000001,0.39900000000000002,null,null,null,null,null,"G McMichael",{"$f":"ROUND(1,2)","v":1},1,2,1,{"$f":"ROUND(18,2)","v":18},null,null,1,0,0,0]
["INFIELDERS",null,"","",null,null,null,null,null,null,null,null,null,null,"M Wohlers",{"$f":"ROUND(1,2)","v":1},2,0,1,{"$f":"ROUND(0,2)","v":0},null,null,0,0,0,0]
["F McGriff",null,57,63,40,20,30,0.28000000000000003,0.48899999999999999,null,null,null,null,null,null,null,null,null,null,{"$f":"IFERROR(IF(O17=\"\",\"\",R17*9/P17),\"INF\")","v":""},null,null,null,null,0,0]
["M Lemke",null,43,39,60,20,70,0.253,0.35599999999999998,null,null,null,null,null,null,null,null,null,null,{"$f":"IFERROR(IF(O18=\"\",\"\",R18*9/P18),\"INF\")","v":""}]
["J Blauser",null,23,36,60,20,65,0.21099999999999999,0.34100000000000003,null,null,null,null,null,null,null,null,null,null,{"$f":"IFERROR(IF(O19=\"\",\"\",R19*9/P19),\"INF\")","v":""}]
["C Jones",null,49,56,65,40,55,0.26500000000000001,0.45,null,null,null,null,null,null,null,null,null,null,{"$f":"IFERROR(IF(O20=\"\",\"\",R20*9/P20),\"INF\")","v":""}]
["R Belliard",null,28,18,60,20,65,0.222,0.24399999999999999,null,null,null,null,null,null,null,null,null,null,{"$f":"IF(O21=\"\",\"\",R21*9/P21)","v":""}]
["M Mordecai",null,57,61,55,20,60,0.28000000000000003,0.48,null,null,null,null,null,null,null,null,null,null,""]
["OUTFIEDLERS",null,"",""]
["R Klesko",null,71,85,55,50,25,0.31,0.60799999999999998]
["M Grissom",null,46,42,75,70,70,0.25800000000000001,0.376]
["D Justice",null,43,61,65,80,55,0.253,0.47899999999999998]
["M Kelly",null,12,31,65,60,60,0.19,0.314]
["D Smith",null,43,49,55,60,60,0.252,0.41199999999999998]
["M Devereaux",null,44,40,65,65,65,0.255,0.36399999999999999]
[]
[]
[]
[]
[]
[]
[]
[]
[]
[]
[]
[]
[]
[null,null,"AB","H","RBI","Run","HR","3B","2B","SB"]
["PITCHERS",null,0,0,0,0,0,0,0,0]
["G Maddux",null,0,0,0,0,0,0,0,0]
["T Glavine",1,1,0,0,0,0,0,0,0]
["J Smoltz",null,0,0,0,0,0,0,0,0]
["S Avery",null,0,0,0,0,0,0,0,0]
["M Wohlers",1,0,0,0,0,0,0,0,0]
["G McMichael",1,0,0,0,0,0,0,0,0]
["B Clontz",null,0,0,0,0,0,0,0,0]
["P Borbon",null,0,0,0,0,0,0,0,0]
["S Bedrosian",null,0,0,0,0,0,0,0,0]
["K Mercker",null,0,0,0,0,0,0,0,0]
["M Stanton",null,0,0,0,0,0,0,0,0]
["CATCHERS",null,0,0,0,0,0,0,0,0]
["J Lopez",1,3,1,1,0,0,0,1,0]
["C O'Brien",null,0,0,0,0,0,0,0,0]
["INFIELDERS",null,0,0,0,0,0,0,0,0]
["F McGriff",1,3,0,0,0,0,0,0,0]
["M Lemke",1,4,0,0,0,0,0,0,0]
["J Blauser",null,0,0,0,0,0,0,0,0]
["C Jones",1,4,0,0,0,0,0,0,0]
["R Belliard",1,3,0,0,0,0,0,0,0]
["M Mordecai",null,0,0,0,0,0,0,0,0]
["OUTFIEDLERS",null,0,0,0,0,0,0,0,0]
["R Klesko",1,3,0,0,0,0,0,0,0]
["M Grissom",1,3,0,0,0,0,0,0,0]
["D Justice",1,2,0,0,1,0,0,0,0]
["M Kelly",null,0,0,0,0,0,0,0,0]
["D Smith",null,0,0,0,0,0,0,0,0]
["M Devereaux",1,1,0,0,0,0,0,0,0]
[null,99,0,0,0,0,0,0,0,0]

{"sheet":"1995Indians","index":9,"n_rows":73,"n_cols":406,"rows_kept":73,"cut":false,"hidden":false,"merged":[[0,26,0,27]]}
["PITCHERS","WHIP","Effectiveness","Stamina",1,"CF","K Lofton",null,1,"D Martinez",null,null,1,"CF","K Lofton",null,null,null,null,null,null,null,null,null,null,null,1995]
["D Martinez",1.1759999999999999,{"$f":"IF(B2=\"\",\"\",ROUND((50/($AB$11-$AB$10))*(B2-$AB$11)+100,0))","v":70},1,2,"SS","O Vizquel",null,2,"C Nagy",null,null,2,"SS","O Vizquel",null,null,null,null,null,null,null,null,null,null,null,"Avg BA (50)",{"$f":"VLOOKUP(AA1,'Settings & Expansion'!M3:P137,2,FALSE)","v":0.26650000000000001}]
["C Nagy",1.4330000000000001,{"$f":"IF(B3=\"\",\"\",ROUND((50/($AB$11-$AB$10))*(B3-$AB$11)+100,0))","v":49},1,3,"2B","C Baerga",null,3,"O Hershiser",null,null,3,"2B","C Baerga",null,null,null,null,null,null,null,null,null,null,null,"Top BA (100)",0.36799999999999999]
["O Hershisher",1.2070000000000001,68,1,4,"LF","A Belle",null,4,"C Ogea",null,null,4,"LF","A Belle"]
["C Ogea",1.1659999999999999,71,1,5,"DH","E Murray",null,null,null,null,null,5,"DH","E Murray"]
["J Mesa",1.0309999999999999,82,3,6,"RF","M Ramirez",null,null,null,null,null,6,"RF","M Ramirez",null,null,null,null,null,null,null,null,null,null,null,"Avg Slg% (50)",{"$f":"VLOOKUP(AA1,'Settings & Expansion'!M3:P137,3,FALSE)","v":0.41749999999999998}]
["J Tavarez",1.141,73,2,7,"1B","H Perry",null,null,null,null,null,7,"1B","H Perry",null,null,null,null,null,null,null,null,null,null,null,"Top Slg% (100)",0.69]
["E Plunk",1.1719999999999999,70,3,8,"3B","J Thome",null,null,null,null,null,8,"3B","J Thome"]
["J Poole",1.1319999999999999,74,3,9,"C","S Alomar",null,null,null,null,null,9,"C","S Alomar",null,null,null,null,null,null,null,null,null,null,null,null,null,null,null,null,null,null,null,null,null,null,null,null,null,null,null,null,null,null,null,null,null,null,null,null,null,null,null,null,null,null,null,null,null,null,null,null,null,null,null,null,null,null,null,null,null,null,null,null,null,null,null,null,null,null,null,null,null,null,null,null,null,null,null,null,null,null,null,null,null,null,null,null,null,null,null,null,null,null,null,null,null,null,null,null,null,null,null,null,null,null,null,null,null,null,null,null,null,null,null,null,null,null,null,null,null,null,null,null,null,null,null,null,null,null,null,null,null,null,null,null,null,null,null,null,null,null,null,null,null,null,null,null,null,null,null,null,null,null,null,null,null,null,null,null,null,null,null,null,null,null,null,null,null,null,null,null,null,null,null,null,null,null,null,null,null,null,null,null,null,null,null,null,null,null,null,null,null,null,null,null,null,null,null,null,null,null,null,null,null,null,null,null,null,null,null,null,null,null,null,null,null,null,null,null,null,null,null,null,null,null,null,null,null,null,null,null,null,null,null,null,null,null,null,null,null,null,null,null,null,null,null,null,null,null,null,null,null,null,null,null,null,null,null,null,null,null,null,null,null,null,null,null,null,null,null,null,null,null,null,null,null,null,null,null,null,null,null,null,null,null,null,null,null,null,null,null,null,null,null,null,null,null,null,null,null,null,null,null,null,null,null,null,null,null,null,null,null,null,null,null,null,null,null,null,null,null,null,null,null,null,null,null,null,null,null,null,null,null,null,null,null,null,null,null,null,null,null,null,null,null,null,null,null,null,null,null,null,null,null,null,null,null,null,null,null,null,null,null,null,null,null,null,null,null,null,null,null,null,null,null,null,null,null,null,null,null,null,null,null,null,null,null,null,null,null,null,null,null,"T Miller"]
["P Assenmacher",1.1479999999999999,72,3,null,null,null,null,null,null,null,null,null,null,null,null,null,null,null,null,null,null,null,null,null,null,"Avg WHIP (50)",{"$f":"VLOOKUP(AA1,'Settings & Expansion'!M3:P137,4,FALSE)","v":1.4215}]
["M Clark",1.484,45,2,null,null,null,null,null,null,null,null,null,"P","D Martinez",null,null,null,null,null,null,null,null,null,null,null,"Low WHIP (100)",0.81100000000000005]
["K Hill",1.46,47,2,null,null,null,null,null,null,null,null,null,null,null,null,null,null,null,{"$f":"IFERROR(IF(O12=\"\",\"\",R12/P12),\"INF\")","v":""}]
["CATCHERS",null,"Contact","Power","Speed","Def/Arm","Bunt","Raw Avg","Raw Slg%",null,null,null,null,null,null,"IP","H","R","K","ERA",null,null,"BB"]
["T Pena",null,{"$f":"IF(H14=\"\",\"\",ROUND((50/($AB$3-$AB$2))*(H14-$AB$3)+100,0))","v":48},{"$f":"IF(I14=\"\",\"\",ROUND((50/($AB$7-$AB$6))*(I14-$AB$7)+100,0))","v":42},55,65,60,0.26200000000000001,0.376,null,null,null,null,"Starter","J Garcia",{"$f":"ROUND(5.66666666666667,2)","v":5.67},4,1,1,{"$f":"ROUND(1.58730158730159,2)","v":1.59},"W",null,1,0,0,0]
["S Alomar",null,{"$f":"IF(H15=\"\",\"\",ROUND((50/($AB$3-$AB$2))*(H15-$AB$3)+100,0))","v":67},{"$f":"IF(I15=\"\",\"\",ROUND((50/($AB$7-$AB$6))*(I15-$AB$7)+100,0))","v":61},55,55,55,0.3,0.47799999999999998,null,null,null,null,null,"J Tavarez",{"$f":"ROUND(2,2)","v":2},4,0,1,{"$f":"ROUND(0,2)","v":0},null,null,0,0,0,0]
["INFIELDERS",null,"","",null,null,null,null,null,null,null,null,null,null,"K Hill",{"$f":"ROUND(1,2)","v":1},0,0,0,{"$f":"ROUND(0,2)","v":0},null,null,0,0,0,0]
["P Sorrento",null,34,67,45,20,35,0.23499999999999999,0.51100000000000001,null,null,null,null,null,null,null,null,null,null,{"$f":"IFERROR(IF(O17=\"\",\"\",R17*9/P17),\"INF\")","v":""},null,null,null,null,0,0]
["C Baerga",null,73,56,60,20,60,0.314,0.45200000000000001,null,null,null,null,null,null,null,null,null,null,{"$f":"IFERROR(IF(O18=\"\",\"\",R18*9/P18),\"INF\")","v":""}]
["O Vizquel",null,50,38,75,20,75,0.26600000000000001,0.35099999999999998,null,null,null,null,null,null,null,null,null,null,{"$f":"IFERROR(IF(O19=\"\",\"\",R19*9/P19),\"INF\")","v":""}]
["J Thome",null,73,76,50,20,35,0.314,0.55800000000000005,null,null,null,null,null,null,null,null,null,null,{"$f":"IFERROR(IF(O20=\"\",\"\",R20*9/P20),\"INF\")","v":""}]
["E Murray",null,78,68,40,20,45,0.32300000000000001,0.51600000000000001,null,null,null,null,null,null,null,null,null,null,{"$f":"IF(O21=\"\",\"\",R21*9/P21)","v":""}]
["H Perry",null,74,58,50,20,55,0.315,0.46300000000000002,null,null,null,null,null,null,null,null,null,null,""]
["A Espinoza",null,43,32,60,20,65,0.252,0.32200000000000001]
["OUTFIELDERS",null,"",""]
["A Belle",null,75,100,40,40,25,0.317,0.69]
["K Lofton",null,71,57,90,60,80,0.31,0.45300000000000001]
["M Ramirez",null,70,76,55,55,30,0.308,0.55800000000000005]
["W Kirby",null,21,28,70,50,60,0.20699999999999999,0.29799999999999999]
["D Winfield",null,13,26,40,55,50,0.191,0.28699999999999998]
[]
[]
[]
[]
[]
[]
[]
[]
[]
[]
[]
[]
[]
[null,null,"AB","H","RBI","Run","HR","3B","2B","SB"]
["PITCHERS",null,0,0,0,0,0,0,0,0]
["D Martinez",null,0,0,0,0,0,0,0,0]
["C Nagy",null,0,0,0,0,0,0,0,0]
["O Hershisher",1,1,1,0,0,0,0,0,0]
["C Ogea",null,0,0,0,0,0,0,0,0]
["J Mesa",null,0,0,0,0,0,0,0,0]
["J Tavarez",1,0,0,0,0,0,0,0,0]
["E Plunk",null,0,0,0,0,0,0,0,0]
["J Poole",null,0,0,0,0,0,0,0,0]
["P Assenmacher",null,0,0,0,0,0,0,0,0]
["M Clark",1,1,0,0,0,0,0,0,0]
["K Hill",null,0,0,0,0,0,0,0,0]
["CATCHERS",null,0,0,0,0,0,0,0,0]
["T Pena",1,4,2,2,1,1,0,0,0]
["S Alomar",null,0,0,0,0,0,0,0,0]
["INFIELDERS",null,0,0,0,0,0,0,0,0]
["P Sorrento",1,4,1,1,2,0,0,1,0]
["C Baerga",1,5,3,0,1,0,0,0,0]
["O Vizquel",1,4,2,1,0,0,0,1,0]
["J Thome",1,3,1,1,1,0,1,0,0]
["E Murray",null,0,0,0,0,0,0,0,0]
["H Perry",null,0,0,0,0,0,0,0,0]
["A Espinoza",null,0,0,0,0,0,0,0,0]
["OUTFIELDERS",1,3,2,5,2,2,0,0,1]
["A Belle",1,5,1,0,1,0,0,0,0]
["K Lofton",1,4,3,0,2,0,0,1,0]
["M Ramirez",null,0,0,0,0,0,0,0,0]
["W Kirby",null,0,0,0,0,0,0,0,0]
["D Winfield",1,1,0,0,0,0,0,0,0]
[null,99,0,0,0,0,0,0,0,0]

{"sheet":"1993BlueJays","index":10,"n_rows":73,"n_cols":406,"rows_kept":73,"cut":false,"hidden":false,"merged":[[0,26,0,27]]}
["PITCHERS","WHIP","Effectiveness","Stamina",1,"LF","R Henderson",null,1,"P Hentgen",null,null,1,"LF","R Henderson",null,null,null,null,null,null,null,null,null,null,null,1993]
["P Hentgen",1.3360000000000001,{"$f":"IF(B2=\"\",\"\",ROUND((50/($AB$11-$AB$10))*(B2-$AB$11)+100,0))","v":55},1,2,"CF","D White",null,2,"J Guzman",null,null,2,"CF","D White",null,null,null,null,null,null,null,null,null,null,null,"Avg BA (50)",{"$f":"VLOOKUP(AA1,'Settings & Expansion'!M3:P137,2,FALSE)","v":0.26550000000000001}]
["J Guzman",1.452,{"$f":"IF(B3=\"\",\"\",ROUND((50/($AB$11-$AB$10))*(B3-$AB$11)+100,0))","v":44},1,3,"DH","P Molitor",null,3,"D Stewart",null,null,3,"DH","P Molitor",null,null,null,null,null,null,null,null,null,null,null,"Top BA (100)",0.37]
["D Stewart",1.3460000000000001,54,1,4,"RF","J Carter",null,4,"T Stottlemyre",null,null,4,"RF","J Carter"]
["T Stottlemyre",1.5449999999999999,36,1,5,"1B","J Olerud",null,null,null,null,null,5,"1B","J Olerud"]
["D Ward",1.0329999999999999,82,3,6,"2B","R Alomar",null,null,null,null,null,6,"2B","R Alomar",null,null,null,null,null,null,null,null,null,null,null,"Avg Slg% (50)",{"$f":"VLOOKUP(AA1,'Settings & Expansion'!M3:P137,3,FALSE)","v":0.40349999999999997}]
["D Cox",1.2190000000000001,65,2,7,"SS","T Fernandez",null,null,null,null,null,7,"SS","T Fernandez",null,null,null,null,null,null,null,null,null,null,null,"Top Slg% (100)",0.63200000000000001]
["M Eichhorn",1.349,54,2,8,"3B","E Sprague",null,null,null,null,null,8,"3B","E Sprague"]
["M Timlin",1.617,29,3,9,"C","P Borders",null,null,null,null,null,9,"C","P Borders",null,null,null,null,null,null,null,null,null,null,null,null,null,null,null,null,null,null,null,null,null,null,null,null,null,null,null,null,null,null,null,null,null,null,null,null,null,null,null,null,null,null,null,null,null,null,null,null,null,null,null,null,null,null,null,null,null,null,null,null,null,null,null,null,null,null,null,null,null,null,null,null,null,null,null,null,null,null,null,null,null,null,null,null,null,null,null,null,null,null,null,null,null,null,null,null,null,null,null,null,null,null,null,null,null,null,null,null,null,null,null,null,null,null,null,null,null,null,null,null,null,null,null,null,null,null,null,null,null,null,null,null,null,null,null,null,null,null,null,null,null,null,null,null,null,null,null,null,null,null,null,null,null,null,null,null,null,null,null,null,null,null,null,null,null,null,null,null,null,null,null,null,null,null,null,null,null,null,null,null,null,null,null,null,null,null,null,null,null,null,null,null,null,null,null,null,null,null,null,null,null,null,null,null,null,null,null,null,null,null,null,null,null,null,null,null,null,null,null,null,null,null,null,null,null,null,null,null,null,null,null,null,null,null,null,null,null,null,null,null,null,null,null,null,null,null,null,null,null,null,null,null,null,null,null,null,null,null,null,null,null,null,null,null,null,null,null,null,null,null,null,null,null,null,null,null,null,null,null,null,null,null,null,null,null,null,null,null,null,null,null,null,null,null,null,null,null,null,null,null,null,null,null,null,null,null,null,null,null,null,null,null,null,null,null,null,null,null,null,null,null,null,null,null,null,null,null,null,null,null,null,null,null,null,null,null,null,null,null,null,null,null,null,null,null,null,null,null,null,null,null,null,null,null,null,null,null,null,null,null,null,null,null,null,null,null,null,null,null,null,null,null,null,null,null,null,null,null,null,null,null,null,null,null,null,null,null,null,null,null,"S Marshall"]
["T Castillo",1.3029999999999999,58,3,null,null,null,null,null,null,null,null,null,null,null,null,null,null,null,null,null,null,null,null,null,null,"Avg WHIP (50)",{"$f":"VLOOKUP(AA1,'Settings & Expansion'!M3:P137,4,FALSE)","v":1.3875}]
["A Leiter",1.419,47,2,null,null,null,null,null,null,null,null,null,"P","P Hentgen",null,null,null,null,null,null,null,null,null,null,null,"Low WHIP (100)",0.84099999999999997]
["J Morris",1.6639999999999999,25,2]
["CATCHERS",null,"Contact","Power","Speed","Def/Arm","Bunt","Raw Avg","Raw Slg%",null,null,null,null,null,null,"IP","H","R","K","ERA",null,null,"BB"]
["P Borders",null,{"$f":"IF(H14=\"\",\"\",ROUND((50/($AB$3-$AB$2))*(H14-$AB$3)+100,0))","v":44},{"$f":"IF(I14=\"\",\"\",ROUND((50/($AB$7-$AB$6))*(I14-$AB$7)+100,0))","v":43},45,70,60,0.254,0.371,null,null,null,null,"Starter","P Hentgen",{"$f":"ROUND(8,2)","v":8},2,2,5,{"$f":"ROUND(2.25,2)","v":2.25},"L",null,1,0,0,0]
["R Knorr",null,{"$f":"IF(H15=\"\",\"\",ROUND((50/($AB$3-$AB$2))*(H15-$AB$3)+100,0))","v":42},{"$f":"IF(I15=\"\",\"\",ROUND((50/($AB$7-$AB$6))*(I15-$AB$7)+100,0))","v":57},50,60,55,0.248,0.436,null,null,null,null,null,null,null,null,null,null,{"$f":"IFERROR(IF(O15=\"\",\"\",R15*9/P15),\"INF\")","v":""},null,null,null,null,0,0]
["INFIELDERS",null,"","",null,null,null,null,null,null,null,null,null,null,null,null,null,null,null,"",null,null,null,null,0,0]
["J Olerud",null,97,93,45,20,30,0.36299999999999999,0.59899999999999998,null,null,null,null,null,null,null,null,null,null,"",null,null,null,null,0,0]
["R Alomar",null,79,69,85,20,75,0.32600000000000001,0.49199999999999999,null,null,null,null,null,null,null,null,null,null,""]
["T Fernandez",null,69,58,70,20,70,0.30599999999999999,0.442,null,null,null,null,null,null,null,null,null,null,""]
["E Sprague",null,47,46,55,20,55,0.26,0.38600000000000001,null,null,null,null,null,null,null,null,null,null,""]
["P Molitor",null,82,73,70,20,60,0.33200000000000002,0.50900000000000001,null,null,null,null,null,null,null,null,null,null,{"$f":"IF(O21=\"\",\"\",R21*9/P21)","v":""}]
["D Coles",null,44,43,60,20,60,0.253,0.371,null,null,null,null,null,null,null,null,null,null,""]
["OUTFIELDERS",null,"",""]
["R Henderson",null,61,65,90,55,65,0.28899999999999998,0.47399999999999998]
["D White",null,54,58,75,65,70,0.27300000000000002,0.438]
["J Carter",null,44,69,60,65,45,0.254,0.48899999999999999]
["T Ward",null,15,30,60,55,65,0.192,0.311]
["D Jackson",null,26,38,55,70,55,0.216,0.34699999999999998]
["R Butler",null,53,39,60,60,60,0.27100000000000002,0.35399999999999998]
[]
[]
[]
[]
[]
[]
[]
[]
[]
[]
[]
[]
[]
[null,null,"AB","H","RBI","Run","HR","3B","2B","SB"]
["PITCHERS",null,0,0,0,0,0,0,0,0]
["P Hentgen",1,0,0,0,0,0,0,0,0]
["J Guzman",null,0,0,0,0,0,0,0,0]
["D Stewart",null,0,0,0,0,0,0,0,0]
["T Stottlemyre",null,0,0,0,0,0,0,0,0]
["D Ward",null,0,0,0,0,0,0,0,0]
["D Cox",null,0,0,0,0,0,0,0,0]
["M Eichhorn",null,0,0,0,0,0,0,0,0]
["M Timlin",null,0,0,0,0,0,0,0,0]
["T Castillo",null,0,0,0,0,0,0,0,0]
["A Leiter",null,0,0,0,0,0,0,0,0]
["J Morris",null,0,0,0,0,0,0,0,0]
["CATCHERS",null,0,0,0,0,0,0,0,0]
["P Borders",1,3,0,0,0,0,0,0,0]
["R Knorr",null,0,0,0,0,0,0,0,0]
["INFIELDERS",null,0,0,0,0,0,0,0,0]
["J Olerud",1,3,0,0,0,0,0,0,0]
["R Alomar",1,3,1,0,0,0,0,1,0]
["T Fernandez",1,3,1,0,0,0,0,0,0]
["E Sprague",1,2,1,0,0,0,0,1,0]
["P Molitor",1,4,0,0,0,0,0,0,0]
["D Coles",null,0,0,0,0,0,0,0,0]
["OUTFIELDERS",null,0,0,0,0,0,0,0,0]
["R Henderson",1,4,1,1,1,1,0,0,0]
["D White",1,4,0,0,0,0,0,0,0]
["J Carter",1,4,0,0,0,0,0,0,0]
["T Ward",null,0,0,0,0,0,0,0,0]
["D Jackson",null,0,0,0,0,0,0,0,0]
["R Butler",null,0,0,0,0,0,0,0,0]
[null,99,0,0,0,0,0,0,0,0]

{"sheet":"1991Twins","index":11,"n_rows":73,"n_cols":28,"rows_kept":73,"cut":false,"hidden":false,"merged":[[0,26,0,27]]}
["PITCHERS","WHIP","Effectiveness","Stamina",1,"LF","D Gladden",null,1,"J Morris",null,null,1,"LF","D Gladden",null,null,null,null,null,null,null,null,null,null,null,1991]
["J Morris",1.2889999999999999,{"$f":"IF(B2=\"\",\"\",ROUND((50/($AB$11-$AB$10))*(B2-$AB$11)+100,0))","v":54},1,2,"2B","C Knoblauch",null,2,"K Tapani",null,null,2,"2B","C Knoblauch",null,null,null,null,null,null,null,null,null,null,null,"Avg BA (50)",{"$f":"VLOOKUP(AA1,'Settings & Expansion'!M3:P137,2,FALSE)","v":0.255}]
["K Tapani",1.0860000000000001,{"$f":"IF(B3=\"\",\"\",ROUND((50/($AB$11-$AB$10))*(B3-$AB$11)+100,0))","v":73},1,3,"CF","K Puckett",null,3,"S Erickson",null,null,3,"CF","K Puckett",null,null,null,null,null,null,null,null,null,null,null,"Top BA (100)",0.34100000000000003]
["S Erickson",1.2749999999999999,56,1,4,"1B","K Hrbek",null,4,"A Anderson",null,null,4,"1B","K Hrbek"]
["A Anderson",1.4139999999999999,43,1,5,"DH","C Davis",null,null,null,null,null,5,"DH","C Davis"]
["R Aguilera",1.0720000000000001,75,3,6,"C","B Harper",null,null,null,null,null,6,"C","B Harper",null,null,null,null,null,null,null,null,null,null,null,"Avg Slg% (50)",{"$f":"VLOOKUP(AA1,'Settings & Expansion'!M3:P137,3,FALSE)","v":0.38400000000000001}]
["M Guthrie",1.6020000000000001,25,2,7,"RF","S Mack",null,null,null,null,null,7,"RF","S Mack",null,null,null,null,null,null,null,null,null,null,null,"Top Slg% (100)",0.59299999999999997]
["C Willis",1.0669999999999999,75,2,8,"3B","M Pagliarulo",null,null,null,null,null,8,"3B","M Pagliarulo"]
["S Bedrosian",1.3580000000000001,48,2,9,"SS","G Gagne",null,null,null,null,null,9,"SS","G Gagne"]
["T Leach",1.4259999999999999,42,2,null,null,null,null,null,null,null,null,null,null,null,null,null,null,null,null,null,null,null,null,null,null,"Avg WHIP (50)",{"$f":"VLOOKUP(AA1,'Settings & Expansion'!M3:P137,4,FALSE)","v":1.3355000000000001}]
["D West",1.3180000000000001,52,2,null,null,null,null,null,null,null,null,null,"P","A Anderson",null,null,null,null,null,null,null,null,null,null,null,"Low WHIP (100)",0.8]
["P Abbott",1.5629999999999999,29,2]
["CATCHERS",null,"Contact","Power","Speed","Def/Arm","Bunt","Raw Avg","Raw Slg%",null,null,null,null,null,null,"IP","H","R","K","ERA",null,null,"BB"]
["B Harper",null,{"$f":"IF(H14=\"\",\"\",ROUND((50/($AB$3-$AB$2))*(H14-$AB$3)+100,0))","v":83},{"$f":"IF(I14=\"\",\"\",ROUND((50/($AB$7-$AB$6))*(I14-$AB$7)+100,0))","v":65},45,60,55,0.311,0.44700000000000001,null,null,null,null,"Starter","A Anderson",8.9999999999999982,5,1,9,{"$f":"IFERROR(IF(O14=\"\",\"\",R14*9/P14),\"INF\")","v":1.0000000000000002}]
["J Ortiz",null,{"$f":"IF(H15=\"\",\"\",ROUND((50/($AB$3-$AB$2))*(H15-$AB$3)+100,0))","v":23},{"$f":"IF(I15=\"\",\"\",ROUND((50/($AB$7-$AB$6))*(I15-$AB$7)+100,0))","v":21},50,55,50,0.20899999999999999,0.26100000000000001,null,null,null,null,null,null,null,null,null,null,""]
["INFIELDERS",null,"","",null,null,null,null,null,null,null,null,null,null,null,null,null,null,null,""]
["K Hrbek",null,67,68,40,20,40,0.28399999999999997,0.46100000000000002,null,null,null,null,null,null,null,null,null,null,""]
["C Knoblauch",null,65,42,75,20,65,0.28100000000000003,0.35,null,null,null,null,null,null,null,null,null,null,""]
["G Gagne",null,56,53,65,20,60,0.26500000000000001,0.39500000000000002,null,null,null,null,null,null,null,null,null,null,""]
["M Pagliarulo",null,64,50,60,20,65,0.27900000000000003,0.38400000000000001,null,null,null,null,null,null,null,null,null,null,""]
["G Larkin",null,68,47,65,20,55,0.28599999999999998,0.373,null,null,null,null,null,null,null,null,null,null,{"$f":"IF(O21=\"\",\"\",R21*9/P21)","v":""}]
["A Newman",null,13,9,60,20,60,0.191,0.21099999999999999,null,null,null,null,null,null,null,null,null,null,""]
["OUTFIELDERS",null,"",""]
["D Gladden",null,45,43,65,60,65,0.247,0.35599999999999998]
["K Puckett",null,87,68,60,75,55,0.31900000000000001,0.46]
["S Mack",null,82,85,60,70,60,0.31,0.52900000000000003]
["C Davis",null,63,79,45,55,40,0.27700000000000002,0.50700000000000001]
["R Bush",null,78,74,60,65,55,0.30299999999999999,0.48499999999999999]
["P Munoz",null,66,78,40,65,45,0.28299999999999997,0.5]
[]
[]
[]
[]
[]
[]
[]
[]
[]
[]
[]
[]
[]
[null,null,"AB","H","RBI","Run","HR","3B","2B","SB"]
["PITCHERS",null,0,0,0,0,0,0,0,0]
["J Morris",null,0,0,0,0,0,0,0,0]
["K Tapani",null,0,0,0,0,0,0,0,0]
["S Erickson",null,0,0,0,0,0,0,0,0]
["A Anderson",1,0,0,0,0,0,0,0,0]
["R Aguilera",null,0,0,0,0,0,0,0,0]
["M Guthrie",null,0,0,0,0,0,0,0,0]
["C Willis",null,0,0,0,0,0,0,0,0]
["S Bedrosian",null,0,0,0,0,0,0,0,0]
["T Leach",null,0,0,0,0,0,0,0,0]
["D West",null,0,0,0,0,0,0,0,0]
["P Abbott",null,0,0,0,0,0,0,0,0]
["CATCHERS",null,0,0,0,0,0,0,0,0]
["B Harper",1,4,1,0,1,0,1,0,0]
["J Ortiz",null,0,0,0,0,0,0,0,0]
["INFIELDERS",null,0,0,0,0,0,0,0,0]
["K Hrbek",1,4,0,0,0,0,0,0,0]
["C Knoblauch",1,5,0,0,0,0,0,0,0]
["G Gagne",1,4,2,1,1,1,0,0,0]
["M Pagliarulo",1,4,2,3,1,1,0,1,0]
["G Larkin",null,0,0,0,0,0,0,0,0]
["A Newman",null,0,0,0,0,0,0,0,0]
["OUTFIELDERS",null,0,0,0,0,0,0,0,0]
["D Gladden",1,5,0,0,0,0,0,0,0]
["K Puckett",1,4,2,1,1,1,0,1,0]
["S Mack",1,3,2,2,2,1,0,0,0]
["C Davis",1,3,1,0,1,0,0,0,0]
["R Bush",null,0,0,0,0,0,0,0,0]
["P Munoz",null,0,0,0,0,0,0,0,0]
[null,99,0,0,0,0,0,0,0,0]

{"sheet":"1989Athletics","index":12,"n_rows":73,"n_cols":28,"rows_kept":73,"cut":false,"hidden":false,"merged":[[0,26,0,27]]}
["PITCHERS","WHIP","Effectiveness","Stamina",1,"LF","R Henderson",null,1,"D Stewart",null,null,1,"LF","R Henderson",null,null,null,null,null,null,null,null,null,null,null,1989]
["D Stewart",1.2769999999999999,{"$f":"IF(B2=\"\",\"\",ROUND((50/($AB$11-$AB$10))*(B2-$AB$11)+100,0))","v":54},1,2,"3B","C Lansford",null,2,"M Moore",null,null,2,"3B","C Lansford",null,null,null,null,null,null,null,null,null,null,null,"Avg BA (50)",{"$f":"VLOOKUP(AA1,'Settings & Expansion'!M3:P137,2,FALSE)","v":0.2535}]
["M Moore",1.1419999999999999,{"$f":"IF(B3=\"\",\"\",ROUND((50/($AB$11-$AB$10))*(B3-$AB$11)+100,0))","v":67},1,3,"RF","J Canseco",null,3,"B Welch",null,null,3,"RF","J Canseco",null,null,null,null,null,null,null,null,null,null,null,"Top BA (100)",0.33900000000000002]
["B Welch",1.2829999999999999,53,1,4,"DH","D Parker",null,4,"S Davis",null,null,4,"DH","D Parker"]
["S Davis",1.506,32,1,5,"CF","D Henderson",null,null,null,null,null,5,"CF","D Henderson"]
["D Eckersley",0.60699999999999998,119,3,6,"1B","M McGwire",null,null,null,null,null,6,"1B","M McGwire",null,null,null,null,null,null,null,null,null,null,null,"Avg Slg% (50)",{"$f":"VLOOKUP(AA1,'Settings & Expansion'!M3:P137,3,FALSE)","v":0.3745}]
["T Burns",0.97599999999999998,83,2,7,"C","T Steinbach",null,null,null,null,null,7,"C","T Steinbach",null,null,null,null,null,null,null,null,null,null,null,"Top Slg% (100)",0.63500000000000001]
["G Nelson",1.125,69,2,8,"2B","T Phillips",null,null,null,null,null,8,"2B","T Phillips"]
["R Honeycutt",1.07,74,3,9,"SS","W Weiss",null,null,null,null,null,9,"SS","W Weiss"]
["M Young",1.9550000000000001,-11,3,null,null,null,null,null,null,null,null,null,null,null,null,null,null,null,null,null,null,null,null,null,null,"Avg WHIP (50)",{"$f":"VLOOKUP(AA1,'Settings & Expansion'!M3:P137,4,FALSE)","v":1.3180000000000001}]
["C Young",1.4770000000000001,35,3,null,null,null,null,null,null,null,null,null,"P","D Stewart",null,null,null,null,null,null,null,null,null,null,null,"Low WHIP (100)",0.8]
["J Corsi",0.93899999999999995,87,2]
["CATCHERS",null,"Contact","Power","Speed","Def/Arm","Bunt","Raw Avg","Raw Slg%",null,null,null,null,null,null,"IP","H","R","K","ERA",null,null,"BB"]
["T Steinbach",null,{"$f":"IF(H14=\"\",\"\",ROUND((50/($AB$3-$AB$2))*(H14-$AB$3)+100,0))","v":61},{"$f":"IF(I14=\"\",\"\",ROUND((50/($AB$7-$AB$6))*(I14-$AB$7)+100,0))","v":46},45,70,65,0.27300000000000002,0.35199999999999998,null,null,null,null,"Starter","D Stewart",null,null,null,null,{"$f":"IFERROR(IF(O14=\"\",\"\",R14*9/P14),\"INF\")","v":"INF"}]
["R Hassey",null,{"$f":"IF(H15=\"\",\"\",ROUND((50/($AB$3-$AB$2))*(H15-$AB$3)+100,0))","v":35},{"$f":"IF(I15=\"\",\"\",ROUND((50/($AB$7-$AB$6))*(I15-$AB$7)+100,0))","v":41},40,60,60,0.22800000000000001,0.32800000000000001,null,null,null,null,null,null,null,null,null,null,""]
["INFIELDERS",null,"","",null,null,null,null,null,null,null,null,null,null,null,null,null,null,null,""]
["M McGwire",null,37,68,45,20,35,0.23100000000000001,0.46700000000000003,null,null,null,null,null,null,null,null,null,null,""]
["T Phillips",null,55,45,65,40,65,0.26200000000000001,0.34799999999999998,null,null,null,null,null,null,null,null,null,null,""]
["M Gallego",null,49,41,60,20,70,0.252,0.32800000000000001,null,null,null,null,null,null,null,null,null,null,""]
["C Lansford",null,98,56,70,20,70,0.33600000000000002,0.40500000000000003,null,null,null,null,null,null,null,null,null,null,""]
["W Weiss",null,38,39,60,20,65,0.23300000000000001,0.318,null,null,null,null,null,null,null,null,null,null,{"$f":"IF(O21=\"\",\"\",R21*9/P21)","v":""}]
["G Hubbard",null,18,38,60,20,65,0.19800000000000001,0.313,null,null,null,null,null,null,null,null,null,null,""]
["OUTFIELDERS",null,"",""]
["R Henderson",null,62,55,90,50,65,0.27400000000000002,0.39900000000000002]
["D Henderson",null,74,62,60,60,50,0.29399999999999998,0.438]
["S Javier",null,47,39,65,65,65,0.248,0.316]
["D Parker",null,56,61,60,60,45,0.26400000000000001,0.432]
["J Canseco",null,59,82,60,40,25,0.26900000000000002,0.54200000000000004]
["L Polonia",null,69,49,70,45,60,0.28599999999999998,0.36899999999999999]
[]
[]
[]
[]
[]
[]
[]
[]
[]
[]
[]
[]
[]
[null,null,"AB","H","RBI","Run","HR","3B","2B","SB"]
["PITCHERS",null,0,0,0,0,0,0,0,0]
["D Stewart",1,0,0,0,0,0,0,0,0]
["M Moore",null,0,0,0,0,0,0,0,0]
["B Welch",null,0,0,0,0,0,0,0,0]
["S Davis",null,0,0,0,0,0,0,0,0]
["D Eckersley",null,0,0,0,0,0,0,0,0]
["T Burns",null,0,0,0,0,0,0,0,0]
["G Nelson",null,0,0,0,0,0,0,0,0]
["R Honeycutt",null,0,0,0,0,0,0,0,0]
["M Young",null,0,0,0,0,0,0,0,0]
["C Young",null,0,0,0,0,0,0,0,0]
["J Corsi",null,0,0,0,0,0,0,0,0]
["CATCHERS",null,0,0,0,0,0,0,0,0]
["T Steinbach",1,0,0,0,0,0,0,0,0]
["R Hassey",null,0,0,0,0,0,0,0,0]
["INFIELDERS",null,0,0,0,0,0,0,0,0]
["M McGwire",1,0,0,0,0,0,0,0,0]
["T Phillips",1,0,0,0,0,0,0,0,0]
["M Gallego",1,0,0,0,0,0,0,0,0]
["C Lansford",1,0,0,0,0,0,0,0,0]
["W Weiss",null,0,0,0,0,0,0,0,0]
["G Hubbard",null,0,0,0,0,0,0,0,0]
["OUTFIELDERS",null,0,0,0,0,0,0,0,0]
["R Henderson",1,0,0,0,0,0,0,0,0]
["D Henderson",1,0,0,0,0,0,0,0,0]
["S Javier",1,0,0,0,0,0,0,0,0]
["D Parker",null,0,0,0,0,0,0,0,0]
["J Canseco",null,0,0,0,0,0,0,0,0]
["L Polonia",null,0,0,0,0,0,0,0,0]
[null,99,0,0,0,0,0,0,0,0]

{"sheet":"1986Mets","index":13,"n_rows":73,"n_cols":406,"rows_kept":73,"cut":false,"hidden":false,"merged":[[0,26,0,27]]}
["PITCHERS","WHIP","Effectiveness","Stamina",1,"CF","M Wilson",null,1,"D Gooden",null,null,1,"CF","M Wilson",null,null,null,null,null,null,null,null,null,null,null,1986]
["D Gooden",1.1080000000000001,{"$f":"IF(B2=\"\",\"\",ROUND((50/($AB$11-$AB$10))*(B2-$AB$11)+100,0))","v":79},1,2,"2B","W Backman",null,2,"R Darling",null,null,2,"2B","W Backman",null,null,null,null,null,null,null,null,null,null,null,"Avg BA (50)",{"$f":"VLOOKUP(AA1,'Settings & Expansion'!M3:P137,2,FALSE)","v":0.25750000000000001}]
["R Darling",1.198,{"$f":"IF(B3=\"\",\"\",ROUND((50/($AB$11-$AB$10))*(B3-$AB$11)+100,0))","v":68},1,3,"1B","K Hernandez",null,3,"B Ojeda",null,null,3,"1B","K Hernandez",null,null,null,null,null,null,null,null,null,null,null,"Top BA (100)",0.35699999999999998]
["B Ojeda",1.0900000000000001,81,1,4,"C","G Carter",null,4,"S Fernandez",null,null,4,"C","G Carter"]
["S Fernandez",1.2330000000000001,64,1,5,"RF","D Strawberry",null,null,null,null,null,5,"RF","D Strawberry"]
["R McDowell",1.1639999999999999,72,3,6,"3B","R Knight",null,null,null,null,null,6,"3B","R Knight",null,null,null,null,null,null,null,null,null,null,null,"Avg Slg% (50)",{"$f":"VLOOKUP(AA1,'Settings & Expansion'!M3:P137,3,FALSE)","v":0.39400000000000002}]
["J Orosco",1.222,65,3,7,"LF","L Dykstra",null,null,null,null,null,7,"LF","L Dykstra",null,null,null,null,null,null,null,null,null,null,null,"Top Slg% (100)",0.57299999999999995]
["D Sisk",1.528,30,2,8,"SS","R Santana",null,null,null,null,null,8,"SS","R Santana"]
["R Anderson",1.1279999999999999,76,2,9,"P","D Gooden",null,null,null,null,null,9,"P","S Fernandez",null,null,null,null,null,null,null,null,null,null,null,null,null,null,null,null,null,null,null,null,null,null,null,null,null,null,null,null,null,null,null,null,null,null,null,null,null,null,null,null,null,null,null,null,null,null,null,null,null,null,null,null,null,null,null,null,null,null,null,null,null,null,null,null,null,null,null,null,null,null,null,null,null,null,null,null,null,null,null,null,null,null,null,null,null,null,null,null,null,null,null,null,null,null,null,null,null,null,null,null,null,null,null,null,null,null,null,null,null,null,null,null,null,null,null,null,null,null,null,null,null,null,null,null,null,null,null,null,null,null,null,null,null,null,null,null,null,null,null,null,null,null,null,null,null,null,null,null,null,null,null,null,null,null,null,null,null,null,null,null,null,null,null,null,null,null,null,null,null,null,null,null,null,null,null,null,null,null,null,null,null,null,null,null,null,null,null,null,null,null,null,null,null,null,null,null,null,null,null,null,null,null,null,null,null,null,null,null,null,null,null,null,null,null,null,null,null,null,null,null,null,null,null,null,null,null,null,null,null,null,null,null,null,null,null,null,null,null,null,null,null,null,null,null,null,null,null,null,null,null,null,null,null,null,null,null,null,null,null,null,null,null,null,null,null,null,null,null,null,null,null,null,null,null,null,null,null,null,null,null,null,null,null,null,null,null,null,null,null,null,null,null,null,null,null,null,null,null,null,null,null,null,null,null,null,null,null,null,null,null,null,null,null,null,null,null,null,null,null,null,null,null,null,null,null,null,null,null,null,null,null,null,null,null,null,null,null,null,null,null,null,null,null,null,null,null,null,null,null,null,null,null,null,null,null,null,null,null,null,null,null,null,null,null,null,null,null,null,null,null,null,null,null,null,null,null,null,null,null,null,null,null,null,null,null,null,null,null,null,null,"S Romo"]
["R Niemann",1.57,25,3,null,null,null,null,null,null,null,null,null,null,null,null,null,null,null,null,null,null,null,null,null,null,"Avg WHIP (50)",{"$f":"VLOOKUP(AA1,'Settings & Expansion'!M3:P137,4,FALSE)","v":1.3545}]
["R Aguilera",1.278,59,2,null,null,null,null,null,null,null,null,null,"P","S Fernandez",null,null,null,null,null,null,null,null,null,null,null,"Low WHIP (100)",0.92300000000000004]
["B Berenyi",1.7390000000000001,5,3]
["CATCHERS",null,"Contact","Power","Speed","Def/Arm","Bunt","Raw Avg","Raw Slg%",null,null,null,null,null,null,"IP","H","R","K","ERA",null,null,"BB"]
["G Carter",null,{"$f":"IF(H14=\"\",\"\",ROUND((50/($AB$3-$AB$2))*(H14-$AB$3)+100,0))","v":49},{"$f":"IF(I14=\"\",\"\",ROUND((50/($AB$7-$AB$6))*(I14-$AB$7)+100,0))","v":63},55,75,55,0.255,0.439,null,null,null,null,"Starter","S Fernandez",{"$f":"ROUND(9,2)","v":9},1,1,8,{"$f":"ROUND(1,2)","v":1},"W",null,3,0,0,0]
["E Hearn",null,{"$f":"IF(H15=\"\",\"\",ROUND((50/($AB$3-$AB$2))*(H15-$AB$3)+100,0))","v":54},{"$f":"IF(I15=\"\",\"\",ROUND((50/($AB$7-$AB$6))*(I15-$AB$7)+100,0))","v":49},50,60,60,0.26500000000000001,0.39,null,null,null,null,null,null,null,null,null,null,{"$f":"IFERROR(IF(O15=\"\",\"\",R15*9/P15),\"INF\")","v":""},null,null,null,null,0,0]
["INFIELDERS",null,"","",null,null,null,null,null,null,null,null,null,null,null,null,null,null,null,""]
["K Hernandez",null,76,65,55,20,40,0.31,0.44600000000000001,null,null,null,null,null,null,null,null,null,null,""]
["W Backman",null,81,47,65,20,65,0.32,0.38500000000000001,null,null,null,null,null,null,null,null,null,null,""]
["R Santana",null,30,11,65,20,70,0.218,0.254,null,null,null,null,null,null,null,null,null,null,""]
["R Knight",null,70,58,60,20,50,0.29799999999999999,0.42399999999999999,null,null,null,null,null,null,null,null,null,null,""]
["T Teufel",null,45,43,60,20,55,0.247,0.36899999999999999,null,null,null,null,null,null,null,null,null,null,{"$f":"IF(O21=\"\",\"\",R21*9/P21)","v":""}]
["H Johnson",null,44,64,65,20,45,0.245,0.44500000000000001,null,null,null,null,null,null,null,null,null,null,""]
["OUTFIELDERS",null,"",""]
["G Foster",null,35,60,55,55,40,0.22700000000000001,0.42899999999999999]
["L Dykstra",null,69,64,75,65,65,0.29499999999999998,0.44500000000000001]
["D Strawberry",null,51,82,70,70,40,0.25900000000000001,0.50700000000000001]
["M Wilson",null,66,60,70,60,65,0.28899999999999998,0.43]
["K Mitchell",null,60,70,55,55,45,0.27700000000000002,0.46600000000000003]
["D Heep",null,62,58,50,60,55,0.28199999999999997,0.42099999999999999]
[]
[]
[]
[]
[]
[]
[]
[]
[]
[]
[]
[]
[]
[null,null,"AB","H","RBI","Run","HR","3B","2B","SB"]
["PITCHERS",null,0,0,0,0,0,0,0,0]
["D Gooden",null,0,0,0,0,0,0,0,0]
["R Darling",null,0,0,0,0,0,0,0,0]
["B Ojeda",null,0,0,0,0,0,0,0,0]
["S Fernandez",1,1,1,0,0,0,0,0,0]
["R McDowell",null,0,0,0,0,0,0,0,0]
["J Orosco",null,0,0,0,0,0,0,0,0]
["D Sisk",null,0,0,0,0,0,0,0,0]
["R Anderson",null,0,0,0,0,0,0,0,0]
["R Niemann",null,0,0,0,0,0,0,0,0]
["R Aguilera",null,0,0,0,0,0,0,0,0]
["B Berenyi",null,0,0,0,0,0,0,0,0]
["CATCHERS",null,0,0,0,0,0,0,0,0]
["G Carter",1,3,2,2,2,0,1,1,0]
["E Hearn",null,0,0,0,0,0,0,0,0]
["INFIELDERS",null,0,0,0,0,0,0,0,0]
["K Hernandez",1,5,1,0,1,0,0,0,0]
["W Backman",1,5,2,0,2,0,0,0,0]
["R Santana",1,4,2,0,0,0,0,0,0]
["R Knight",1,3,1,3,1,1,0,0,0]
["T Teufel",null,0,0,0,0,0,0,0,0]
["H Johnson",null,0,0,0,0,0,0,0,0]
["OUTFIELDERS",null,0,0,0,0,0,0,0,0]
["G Foster",null,0,0,0,0,0,0,0,0]
["L Dykstra",1,4,1,0,0,0,0,0,0]
["D Strawberry",1,4,1,1,0,0,0,0,0]
["M Wilson",1,5,1,0,0,0,0,0,0]
["K Mitchell",null,0,0,0,0,0,0,0,0]
["D Heep",null,0,0,0,0,0,0,0,0]
[null,99,0,0,0,0,0,0,0,0]

{"sheet":"1985Royals","index":14,"n_rows":73,"n_cols":28,"rows_kept":73,"cut":false,"hidden":false,"merged":[[0,26,0,27]]}
["PITCHERS","WHIP","Effectiveness","Stamina",1,"LF","L Smith",null,1,"B Saberhagen",null,null,1,"LF","L Smith",null,null,null,null,null,null,null,null,null,null,null,1985]
["B Saberhagen",1.0580000000000001,{"$f":"IF(B2=\"\",\"\",ROUND((50/($AB$11-$AB$10))*(B2-$AB$11)+100,0))","v":79},1,2,"CF","W Wilson",null,2,"C Leibrandt",null,null,2,"CF","W Wilson",null,null,null,null,null,null,null,null,null,null,null,"Avg BA (50)",{"$f":"VLOOKUP(AA1,'Settings & Expansion'!M3:P137,2,FALSE)","v":0.25650000000000001}]
["C Leibrandt",1.224,{"$f":"IF(B3=\"\",\"\",ROUND((50/($AB$11-$AB$10))*(B3-$AB$11)+100,0))","v":62},1,3,"3B","G Brett",null,3,"D Jackson",null,null,3,"3B","G Brett",null,null,null,null,null,null,null,null,null,null,null,"Top BA (100)",0.36799999999999999]
["D Jackson",1.37,47,1,4,"2B","F White",null,4,"B Black",null,null,4,"2B","F White"]
["B Black",1.337,51,1,5,"C","J Sundberg",null,null,null,null,null,5,"C","J Sundberg"]
["D Quisenberry",1.2250000000000001,62,3,6,"1B","S Balboni",null,null,null,null,null,6,"1B","S Balboni",null,null,null,null,null,null,null,null,null,null,null,"Avg Slg% (50)",{"$f":"VLOOKUP(AA1,'Settings & Expansion'!M3:P137,3,FALSE)","v":0.39}]
["J Beckwith",1.379,46,2,7,"RF","D Motley",null,null,null,null,null,7,"RF","D Motley",null,null,null,null,null,null,null,null,null,null,null,"Top Slg% (100)",0.58499999999999996]
["M Jones",1.5780000000000001,26,2,8,"SS","B Biancalana",null,null,null,null,null,8,"SS","B Biancalana"]
["M LaCoss",1.9179999999999999,-9,3,9,"P","B Saberhagen",null,null,null,null,null,9,"P","M Huismann"]
["S Farr",1.4339999999999999,41,2,null,null,null,null,null,null,null,null,null,null,null,null,null,null,null,null,null,null,null,null,null,null,"Avg WHIP (50)",{"$f":"VLOOKUP(AA1,'Settings & Expansion'!M3:P137,4,FALSE)","v":1.3420000000000001}]
["M Gubicza",1.3360000000000001,51,2,null,null,null,null,null,null,null,null,null,"P","M Huismann",null,null,null,null,null,null,null,null,null,null,null,"Low WHIP (100)",0.85699999999999998]
["M Huismann",0.91100000000000003,94,3]
["CATCHERS",null,"Contact","Power","Speed","Def/Arm","Bunt","Raw Avg","Raw Slg%",null,null,null,null,null,null,"IP","H","R","K","ERA",null,null,"BB"]
["J Sundberg",null,{"$f":"IF(H14=\"\",\"\",ROUND((50/($AB$3-$AB$2))*(H14-$AB$3)+100,0))","v":45},{"$f":"IF(I14=\"\",\"\",ROUND((50/($AB$7-$AB$6))*(I14-$AB$7)+100,0))","v":48},45,70,60,0.245,0.38100000000000001,null,null,null,null,"Starter","D Jackson",{"$f":"ROUND(7.66666666666666,2)","v":7.67},5,1,2,{"$f":"ROUND(1.17340286831812,2)","v":1.17},null,null,2,0,0,0]
["J Wathan",null,{"$f":"IF(H15=\"\",\"\",ROUND((50/($AB$3-$AB$2))*(H15-$AB$3)+100,0))","v":40},{"$f":"IF(I15=\"\",\"\",ROUND((50/($AB$7-$AB$6))*(I15-$AB$7)+100,0))","v":33},50,60,55,0.23400000000000001,0.32400000000000001,null,null,null,null,null,"M LaCoss",{"$f":"ROUND(0,2)","v":0},0,0,0,0,null,null,0,0,0,0]
["INFIELDERS",null,"","",null,null,null,null,null,null,null,null,null,null,"M Jones",{"$f":"ROUND(0.333333333333333,2)","v":0.33},0,0,0,{"$f":"ROUND(0,2)","v":0},null,null,0,0,0,0]
["S Balboni",null,44,72,40,20,30,0.24299999999999999,0.47699999999999998,null,null,null,null,null,"D Quisenberry",{"$f":"ROUND(0.666666666666667,2)","v":0.67},4,4,0,{"$f":"ROUND(53.7313432835821,2)","v":53.73},"L",null,1,0,0,0]
["F White",null,47,56,65,20,65,0.249,0.41399999999999998,null,null,null,null,null,"M Huismann",{"$f":"ROUND(0.333333333333333,2)","v":0.33},0,0,0,{"$f":"ROUND(0,2)","v":0},null,null,0,0,0,0]
["O Concepcion",null,26,13,60,20,70,0.20399999999999999,0.245,null,null,null,null,null,null,null,null,null,null,{"$f":"IFERROR(IF(O19=\"\",\"\",R19*9/P19),\"INF\")","v":""}]
["G Brett",null,85,100,60,20,45,0.33500000000000002,0.58499999999999996,null,null,null,null,null,null,null,null,null,null,{"$f":"IFERROR(IF(O20=\"\",\"\",R20*9/P20),\"INF\")","v":""}]
["J Orta",null,55,48,60,45,40,0.26700000000000002,0.38300000000000001,null,null,null,null,null,null,null,null,null,null,{"$f":"IF(O21=\"\",\"\",R21*9/P21)","v":""}]
["B Biancalana",null,19,17,55,20,65,0.188,0.26100000000000001,null,null,null,null,null,null,null,null,null,null,""]
["OUTFIELDERS",null,"",""]
["L Smith",null,50,44,80,60,55,0.25700000000000001,0.36599999999999999]
["W Wilson",null,60,55,80,65,70,0.27800000000000002,0.40799999999999997]
["D Motley",null,35,56,60,55,60,0.222,0.41299999999999998]
["H McRae",null,51,65,55,60,65,0.25900000000000001,0.45]
["P Sheridan",null,37,36,45,60,45,0.22800000000000001,0.33500000000000002]
["L Jones",null,30,16,60,60,60,0.21099999999999999,0.25700000000000001]
[]
[]
[]
[]
[]
[]
[]
[]
[]
[]
[]
[]
[]
[null,null,"AB","H","RBI","Run","HR","3B","2B","SB"]
["PITCHERS",null,0,0,0,0,0,0,0,0]
["B Saberhagen",null,0,0,0,0,0,0,0,0]
["C Leibrandt",null,0,0,0,0,0,0,0,0]
["D Jackson",1,3,3,0,1,0,0,1,0]
["B Black",null,0,0,0,0,0,0,0,0]
["D Quisenberry",1,0,0,0,0,0,0,0,0]
["J Beckwith",null,0,0,0,0,0,0,0,0]
["M Jones",1,0,0,0,0,0,0,0,0]
["M LaCoss",1,0,0,0,0,0,0,0,0]
["S Farr",null,0,0,0,0,0,0,0,0]
["M Gubicza",null,0,0,0,0,0,0,0,0]
["M Huismann",1,1,0,0,0,0,0,0,0]
["CATCHERS",null,0,0,0,0,0,0,0,0]
["J Sundberg",1,4,3,0,1,0,0,2,0]
["J Wathan",null,0,0,0,0,0,0,0,0]
["INFIELDERS",null,0,0,0,0,0,0,0,0]
["S Balboni",1,4,0,0,0,0,0,0,0]
["F White",1,4,1,0,1,0,0,0,0]
["O Concepcion",null,0,0,0,0,0,0,0,0]
["G Brett",1,4,0,0,0,0,0,0,0]
["J Orta",null,0,0,0,0,0,0,0,0]
["B Biancalana",1,5,1,1,0,0,0,1,0]
["OUTFIELDERS",null,0,0,0,0,0,0,0,0]
["L Smith",1,5,1,1,0,0,0,1,0]
["W Wilson",1,3,0,0,0,0,0,0,0]
["D Motley",1,4,2,1,0,0,0,0,0]
["H McRae",null,0,0,0,0,0,0,0,0]
["P Sheridan",null,0,0,0,0,0,0,0,0]
["L Jones",null,0,0,0,0,0,0,0,0]
[null,99,0,0,0,0,0,0,0,0]

{"sheet":"1984Tigers","index":15,"n_rows":73,"n_cols":28,"rows_kept":73,"cut":false,"hidden":false,"merged":[[0,26,0,27]]}
["PITCHERS","WHIP","Effectiveness","Stamina",1,"2B","L Whitaker",null,1,"J Morris",null,null,1,"2B","L Whitaker",null,null,null,null,null,null,null,null,null,null,null,1984]
["J Morris",1.282,{"$f":"IF(B2=\"\",\"\",ROUND((50/($AB$11-$AB$10))*(B2-$AB$11)+100,0))","v":58},1,2,"SS","A Trammell",null,2,"D Petry",null,null,2,"SS","A Trammell",null,null,null,null,null,null,null,null,null,null,null,"Avg BA (50)",{"$f":"VLOOKUP(AA1,'Settings & Expansion'!M3:P137,2,FALSE)","v":0.25950000000000001}]
["D Petry",1.2729999999999999,{"$f":"IF(B3=\"\",\"\",ROUND((50/($AB$11-$AB$10))*(B3-$AB$11)+100,0))","v":59},1,3,"RF","K Gibson",null,3,"M Wilcox",null,null,3,"RF","K Gibson",null,null,null,null,null,null,null,null,null,null,null,"Top BA (100)",0.35099999999999998]
["M Wilcox",1.286,57,1,4,"C","L Parrish",null,4,"J Berenguer",null,null,4,"C","L Parrish"]
["J Berenguer",1.337,51,1,5,"LF","L Herndon",null,null,null,null,null,5,"LF","L Herndon"]
["W Hernandez",0.94099999999999995,100,3,6,"DH","B Garbey",null,null,null,null,null,6,"DH","B Garbey",null,null,null,null,null,null,null,null,null,null,null,"Avg Slg% (50)",{"$f":"VLOOKUP(AA1,'Settings & Expansion'!M3:P137,3,FALSE)","v":0.38350000000000001}]
["A Lopez",1.169,72,2,7,"CF","C Lemon",null,null,null,null,null,7,"CF","C Lemon",null,null,null,null,null,null,null,null,null,null,null,"Top Slg% (100)",0.54700000000000004]
["D Blair",1.26,60,2,8,"3B","H Johnson",null,null,null,null,null,8,"3B","H Johnson"]
["S Monge",1.444,37,3,9,"1B","D Bergman",null,null,null,null,null,9,"1B","D Bergman"]
["B Scherrer",1.1579999999999999,73,3,null,null,null,null,null,null,null,null,null,null,null,null,null,null,null,null,null,null,null,null,null,null,"Avg WHIP (50)",{"$f":"VLOOKUP(AA1,'Settings & Expansion'!M3:P137,4,FALSE)","v":1.3425}]
["D Rozema",1.2669999999999999,59,2,null,null,null,null,null,null,null,null,null,"P","G Abbott",null,null,null,null,null,null,null,null,null,null,null,"Low WHIP (100)",0.94099999999999995]
["G Abbott",1.591,19,2]
["CATCHERS",null,"Contact","Power","Speed","Def/Arm","Bunt","Raw Avg","Raw Slg%",null,null,null,null,null,null,"IP","H","R","K","ERA",null,null,"BB"]
["L Parrish",null,{"$f":"IF(H14=\"\",\"\",ROUND((50/($AB$3-$AB$2))*(H14-$AB$3)+100,0))","v":38},{"$f":"IF(I14=\"\",\"\",ROUND((50/($AB$7-$AB$6))*(I14-$AB$7)+100,0))","v":68},45,70,60,0.23699999999999999,0.443,null,null,null,null,"Starter","D Petry",{"$f":"ROUND(6,2)","v":6},7,4,2,{"$f":"ROUND(6,2)","v":6},null,null,0,0,0,0]
["D Lowry",null,{"$f":"IF(H15=\"\",\"\",ROUND((50/($AB$3-$AB$2))*(H15-$AB$3)+100,0))","v":42},{"$f":"IF(I15=\"\",\"\",ROUND((50/($AB$7-$AB$6))*(I15-$AB$7)+100,0))","v":62},40,60,50,0.24399999999999999,0.42199999999999999,null,null,null,null,null,"A Lopez",{"$f":"ROUND(2,2)","v":2},1,0,1,{"$f":"ROUND(0,2)","v":0},null,null,0,0,0,0]
["INFIELDERS",null,"","",null,null,null,null,null,null,null,null,null,null,"G Abbott",{"$f":"ROUND(0.333333333333333,2)","v":0.33},3,2,0,{"$f":"ROUND(54.5454545454545,2)","v":54.55},"L",null,0,0,0,0]
["D Bergman",null,57,60,55,20,40,0.27300000000000002,0.41699999999999998,null,null,null,null,null,null,null,null,null,null,{"$f":"IFERROR(IF(O17=\"\",\"\",R17*9/P17),\"INF\")","v":""},null,null,null,null,0,0]
["L Whitaker",null,66,57,65,20,70,0.28899999999999998,0.40699999999999997,null,null,null,null,null,null,null,null,null,null,{"$f":"IFERROR(IF(O18=\"\",\"\",R18*9/P18),\"INF\")","v":""},null,null,null,null,0,0]
["A Trammell",null,80,76,70,20,70,0.314,0.46800000000000003,null,null,null,null,null,null,null,null,null,null,{"$f":"IFERROR(IF(O19=\"\",\"\",R19*9/P19),\"INF\")","v":""}]
["H Johnson",null,44,53,60,20,60,0.248,0.39400000000000002,null,null,null,null,null,null,null,null,null,null,{"$f":"IFERROR(IF(O20=\"\",\"\",R20*9/P20),\"INF\")","v":""}]
["B Garbey",null,65,52,60,50,45,0.28699999999999998,0.39100000000000001,null,null,null,null,null,null,null,null,null,null,{"$f":"IF(O21=\"\",\"\",R21*9/P21)","v":""}]
["T Brookens",null,43,54,55,45,55,0.246,0.39700000000000002,null,null,null,null,null,null,null,null,null,null,""]
["OUTFIELDERS",null,"",""]
["L Herndon",null,61,55,60,60,65,0.28000000000000003,0.4]
["C Lemon",null,65,84,65,65,65,0.28699999999999998,0.495]
["K Gibson",null,62,91,80,70,40,0.28199999999999997,0.51600000000000001]
["D Evans",null,35,50,50,60,65,0.23200000000000001,0.38400000000000001]
["R Jones",null,63,91,55,65,40,0.28399999999999997,0.51600000000000001]
["R Kuntz",null,64,59,60,55,55,0.28599999999999998,0.41399999999999998]
[]
[]
[]
[]
[]
[]
[]
[]
[]
[]
[]
[]
[]
[null,null,"AB","H","RBI","Run","HR","3B","2B","SB"]
["PITCHERS",null,0,0,0,0,0,0,0,0]
["J Morris",null,0,0,0,0,0,0,0,0]
["D Petry",1,0,0,0,0,0,0,0,0]
["M Wilcox",null,0,0,0,0,0,0,0,0]
["J Berenguer",null,0,0,0,0,0,0,0,0]
["W Hernandez",null,0,0,0,0,0,0,0,0]
["A Lopez",1,0,0,0,0,0,0,0,0]
["D Blair",null,0,0,0,0,0,0,0,0]
["S Monge",null,0,0,0,0,0,0,0,0]
["B Scherrer",null,0,0,0,0,0,0,0,0]
["D Rozema",null,0,0,0,0,0,0,0,0]
["G Abbott",1,0,0,0,0,0,0,0,0]
["CATCHERS",null,0,0,0,0,0,0,0,0]
["L Parrish",1,4,1,1,1,1,0,0,0]
["D Lowry",null,0,0,0,0,0,0,0,0]
["INFIELDERS",null,0,0,0,0,0,0,0,0]
["D Bergman",1,2,0,0,0,0,0,0,0]
["L Whitaker",1,5,1,0,0,0,0,0,0]
["A Trammell",1,5,0,0,0,0,0,0,0]
["H Johnson",1,3,1,0,0,0,0,0,0]
["B Garbey",1,3,2,0,0,0,0,0,0]
["T Brookens",null,0,0,0,0,0,0,0,0]
["OUTFIELDERS",null,0,0,0,0,0,0,0,0]
["L Herndon",1,4,2,1,2,1,0,1,0]
["C Lemon",1,4,2,1,0,0,0,1,0]
["K Gibson",1,4,1,1,1,1,0,0,0]
["D Evans",null,0,0,0,0,0,0,0,0]
["R Jones",null,0,0,0,0,0,0,0,0]
["R Kuntz",null,0,0,0,0,0,0,0,0]
[null,99,0,0,0,0,0,0,0,0]

{"sheet":"1975Reds","index":16,"n_rows":73,"n_cols":406,"rows_kept":73,"cut":false,"hidden":false,"merged":[[0,26,0,27]]}
["PITCHERS","WHIP","Effectiveness","Stamina",1,"3B","P Rose",null,1,"G Nolan",null,null,1,"3B","P Rose",null,null,null,null,null,null,null,null,null,null,null,1975]
["G Nolan",1.097,{"$f":"IF(B2=\"\",\"\",ROUND((50/($AB$11-$AB$10))*(B2-$AB$11)+100,0))","v":88},1,2,"RF","K Griffey",null,2,"J Billingham",null,null,2,"RF","K Griffey",null,null,null,null,null,null,null,null,null,null,null,"Avg BA (50)",{"$f":"VLOOKUP(AA1,'Settings & Expansion'!M3:P137,2,FALSE)","v":0.25750000000000001}]
["J Billingham",1.4330000000000001,{"$f":"IF(B3=\"\",\"\",ROUND((50/($AB$11-$AB$10))*(B3-$AB$11)+100,0))","v":40},1,3,"2B","J Morgan",null,3,"F Norman",null,null,3,"2B","J Morgan",null,null,null,null,null,null,null,null,null,null,null,"Top BA (100)",0.35899999999999999]
["F Norman",1.3140000000000001,57,1,4,"1B","T Perez",null,4,"D Gullett",null,null,4,"1B","T Perez"]
["D Gullett",1.1459999999999999,81,1,5,"C","J Bench",null,null,null,null,null,5,"C","J Bench"]
["R Eastwick",1.133,82,3,6,"LF","G Foster",null,null,null,null,null,6,"LF","G Foster",null,null,null,null,null,null,null,null,null,null,null,"Avg Slg% (50)",{"$f":"VLOOKUP(AA1,'Settings & Expansion'!M3:P137,3,FALSE)","v":0.374}]
["P Borbon",1.3280000000000001,55,2,7,"SS","D Concepcion",null,null,null,null,null,7,"SS","D Concepcion",null,null,null,null,null,null,null,null,null,null,null,"Top Slg% (100)",0.56599999999999995]
["C Carroll",1.298,59,2,8,"CF","C Geronimo",null,null,null,null,null,8,"CF","C Geronimo"]
["W McEnaney",1.264,64,3,9,"P","G Nolan",null,null,null,null,null,9,"P","J Billingham",null,null,null,null,null,null,null,null,null,null,null,null,null,null,null,null,null,null,null,null,null,null,null,null,null,null,null,null,null,null,null,null,null,null,null,null,null,null,null,null,null,null,null,null,null,null,null,null,null,null,null,null,null,null,null,null,null,null,null,null,null,null,null,null,null,null,null,null,null,null,null,null,null,null,null,null,null,null,null,null,null,null,null,null,null,null,null,null,null,null,null,null,null,null,null,null,null,null,null,null,null,null,null,null,null,null,null,null,null,null,null,null,null,null,null,null,null,null,null,null,null,null,null,null,null,null,null,null,null,null,null,null,null,null,null,null,null,null,null,null,null,null,null,null,null,null,null,null,null,null,null,null,null,null,null,null,null,null,null,null,null,null,null,null,null,null,null,null,null,null,null,null,null,null,null,null,null,null,null,null,null,null,null,null,null,null,null,null,null,null,null,null,null,null,null,null,null,null,null,null,null,null,null,null,null,null,null,null,null,null,null,null,null,null,null,null,null,null,null,null,null,null,null,null,null,null,null,null,null,null,null,null,null,null,null,null,null,null,null,null,null,null,null,null,null,null,null,null,null,null,null,null,null,null,null,null,null,null,null,null,null,null,null,null,null,null,null,null,null,null,null,null,null,null,null,null,null,null,null,null,null,null,null,null,null,null,null,null,null,null,null,null,null,null,null,null,null,null,null,null,null,null,null,null,null,null,null,null,null,null,null,null,null,null,null,null,null,null,null,null,null,null,null,null,null,null,null,null,null,null,null,null,null,null,null,null,null,null,null,null,null,null,null,null,null,null,null,null,null,null,null,null,null,null,null,null,null,null,null,null,null,null,null,null,null,null,null,null,null,null,null,null,null,null,null,null,null,null,null,null,null,null,null,null,null,null,null,null,null,null,"A Rhodes"]
["P Darcy",1.4770000000000001,34,2,null,null,null,null,null,null,null,null,null,null,null,null,null,null,null,null,null,null,null,null,null,null,"Avg WHIP (50)",{"$f":"VLOOKUP(AA1,'Settings & Expansion'!M3:P137,4,FALSE)","v":1.3610000000000002}]
["C Kirby",1.5089999999999999,29,2,null,null,null,null,null,null,null,null,null,"P","J Billingham",null,null,null,null,null,null,null,null,null,null,null,"Low WHIP (100)",1.0089999999999999]
["T Carroll",1.66,8,3]
["CATCHERS",null,"Contact","Power","Speed","Def/Arm","Bunt","Raw Avg","Raw Slg%",null,null,null,null,null,null,"IP","H","R","K","ERA",null,null,"BB"]
["J Bench",null,{"$f":"IF(H14=\"\",\"\",ROUND((50/($AB$3-$AB$2))*(H14-$AB$3)+100,0))","v":63},{"$f":"IF(I14=\"\",\"\",ROUND((50/($AB$7-$AB$6))*(I14-$AB$7)+100,0))","v":88},60,90,35,0.28299999999999997,0.51900000000000002,null,null,null,null,"Starter","J Billingham",1,null,null,null,{"$f":"IFERROR(IF(O14=\"\",\"\",R14*9/P14),\"INF\")","v":0},"W",null,null,null,0,0]
["B Plummer",null,{"$f":"IF(H15=\"\",\"\",ROUND((50/($AB$3-$AB$2))*(H15-$AB$3)+100,0))","v":13},{"$f":"IF(I15=\"\",\"\",ROUND((50/($AB$7-$AB$6))*(I15-$AB$7)+100,0))","v":34},50,60,55,0.182,0.314,null,null,null,null,null,null,null,null,null,null,"",null,null,null,null,0,0]
["INFIELDERS",null,"","",null,null,null,null,null,null,null,null,null,null,null,null,null,null,null,"",null,null,null,null,0,0]
["T Perez",null,62,74,50,20,40,0.28199999999999997,0.46600000000000003,null,null,null,null,null,null,null,null,null,null,""]
["J Morgan",null,84,85,85,20,75,0.32700000000000001,0.50800000000000001,null,null,null,null,null,null,null,null,null,null,""]
["D Concepcion",null,58,45,75,20,70,0.27400000000000002,0.35299999999999998,null,null,null,null,null,null,null,null,null,null,""]
["P Rose",null,79,65,60,50,70,0.317,0.432,null,null,null,null,null,null,null,null,null,null,""]
["D Driessen",null,62,64,45,45,50,0.28100000000000003,0.42899999999999999,null,null,null,null,null,null,null,null,null,null,{"$f":"IF(O21=\"\",\"\",R21*9/P21)","v":""}]
["D Chaney",null,31,29,50,20,60,0.219,0.29399999999999998,null,null,null,null,null,null,null,null,null,null,""]
["D Flynn",null,55,43,55,20,50,0.26800000000000002,0.34599999999999997]
["OUTFIELDERS",null,"",""]
["G Foster",null,71,88,50,65,40,0.3,0.51800000000000002]
["C Geronimo",null,50,47,70,80,55,0.25700000000000001,0.36299999999999999]
["K Griffey",null,73,57,65,70,65,0.30499999999999999,0.40200000000000002]
["M Rettenmund",null,41,34,65,55,65,0.23899999999999999,0.314]
["T Crowley",null,55,55,40,45,40,0.26800000000000002,0.39400000000000002]
[]
[]
[]
[]
[]
[]
[]
[]
[]
[]
[]
[]
[]
[null,null,"AB","H","RBI","Run","HR","3B","2B","SB"]
["PITCHERS",null,0,0,0,0,0,0,0,0]
["G Nolan",null,0,0,0,0,0,0,0,0]
["J Billingham",1,1,1,0,1,0,0,1,0]
["F Norman",null,0,0,0,0,0,0,0,0]
["D Gullett",null,0,0,0,0,0,0,0,0]
["R Eastwick",null,0,0,0,0,0,0,0,0]
["P Borbon",null,0,0,0,0,0,0,0,0]
["C Carroll",null,0,0,0,0,0,0,0,0]
["W McEnaney",null,0,0,0,0,0,0,0,0]
["P Darcy",null,0,0,0,0,0,0,0,0]
["C Kirby",null,0,0,0,0,0,0,0,0]
["T Carroll",null,0,0,0,0,0,0,0,0]
["CATCHERS",null,0,0,0,0,0,0,0,0]
["J Bench",1,1,0,0,0,0,0,0,0]
["B Plummer",null,0,0,0,0,0,0,0,0]
["INFIELDERS",null,0,0,0,0,0,0,0,0]
["T Perez",1,0,0,0,0,0,0,0,0]
["J Morgan",1,1,1,1,0,0,0,1,0]
["D Concepcion",1,1,0,0,0,0,0,0,0]
["P Rose",1,2,2,3,2,1,0,0,0]
["D Driessen",null,0,0,0,0,0,0,0,0]
["D Chaney",null,0,0,0,0,0,0,0,0]
["D Flynn",null,0,0,0,0,0,0,0,0]
["OUTFIELDERS",null,0,0,0,0,0,0,0,0]
["G Foster",1,1,0,0,0,0,0,0,0]
["C Geronimo",1,1,1,0,1,0,0,0,0]
["K Griffey",1,1,1,0,1,0,0,0,0]
["M Rettenmund",null,0,0,0,0,0,0,0,0]
["T Crowley",null,0,0,0,0,0,0,0,0]
[null,99,0,0,0,0,0,0,0,0]

{"sheet":"1972Athletics","index":17,"n_rows":73,"n_cols":406,"rows_kept":73,"cut":false,"hidden":false,"merged":[[0,26,0,27]]}
["PITCHERS","WHIP","Effectiveness","Stamina",1,"SS","B Campaneris",null,1,"C Hunter",null,null,1,"SS","B Campaneris",null,null,null,null,null,null,null,null,null,null,null,1972]
["C Hunter",0.91400000000000003,{"$f":"IF(B2=\"\",\"\",ROUND((50/($AB$11-$AB$10))*(B2-$AB$11)+100,0))","v":91},1,2,"RF","M Alou",null,2,"K Holtzman",null,null,2,"RF","M Alou",null,null,null,null,null,null,null,null,null,null,null,"Avg BA (50)",{"$f":"VLOOKUP(AA1,'Settings & Expansion'!M3:P137,2,FALSE)","v":0.24349999999999999}]
["K Holtzman",1.07,{"$f":"IF(B3=\"\",\"\",ROUND((50/($AB$11-$AB$10))*(B3-$AB$11)+100,0))","v":73},1,3,"LF","J Rudi",null,3,"BM Odom",null,null,3,"LF","J Rudi",null,null,null,null,null,null,null,null,null,null,null,"Top BA (100)",0.33300000000000002]
["BM Odom",1.292,46,1,4,"RF","R Jackson",null,4,"V Blue",null,null,4,"RF","R Jackson"]
["V Blue",1.093,70,1,5,"1B","M Epstein",null,null,null,null,null,5,"1B","M Epstein"]
["R Fingers",1.0509999999999999,75,3,6,"3B","S Bando",null,null,null,null,null,6,"3B","S Bando",null,null,null,null,null,null,null,null,null,null,null,"Avg Slg% (50)",{"$f":"VLOOKUP(AA1,'Settings & Expansion'!M3:P137,3,FALSE)","v":0.35399999999999998}]
["J Horlen",1.119,67,2,7,"CF","A Mangual",null,null,null,null,null,7,"CF","A Mangual",null,null,null,null,null,null,null,null,null,null,null,"Top Slg% (100)",0.60599999999999998]
["B Locker",1.0900000000000001,70,3,8,"2B","T Cullen",null,null,null,null,null,8,"2B","T Cullen"]
["D Knowles",1.31,44,3,9,"P","C Hunter",null,null,null,null,null,9,"P","C Hunter",null,null,null,null,null,null,null,null,null,null,null,null,null,null,null,null,null,null,null,null,null,null,null,null,null,null,null,null,null,null,null,null,null,null,null,null,null,null,null,null,null,null,null,null,null,null,null,null,null,null,null,null,null,null,null,null,null,null,null,null,null,null,null,null,null,null,null,null,null,null,null,null,null,null,null,null,null,null,null,null,null,null,null,null,null,null,null,null,null,null,null,null,null,null,null,null,null,null,null,null,null,null,null,null,null,null,null,null,null,null,null,null,null,null,null,null,null,null,null,null,null,null,null,null,null,null,null,null,null,null,null,null,null,null,null,null,null,null,null,null,null,null,null,null,null,null,null,null,null,null,null,null,null,null,null,null,null,null,null,null,null,null,null,null,null,null,null,null,null,null,null,null,null,null,null,null,null,null,null,null,null,null,null,null,null,null,null,null,null,null,null,null,null,null,null,null,null,null,null,null,null,null,null,null,null,null,null,null,null,null,null,null,null,null,null,null,null,null,null,null,null,null,null,null,null,null,null,null,null,null,null,null,null,null,null,null,null,null,null,null,null,null,null,null,null,null,null,null,null,null,null,null,null,null,null,null,null,null,null,null,null,null,null,null,null,null,null,null,null,null,null,null,null,null,null,null,null,null,null,null,null,null,null,null,null,null,null,null,null,null,null,null,null,null,null,null,null,null,null,null,null,null,null,null,null,null,null,null,null,null,null,null,null,null,null,null,null,null,null,null,null,null,null,null,null,null,null,null,null,null,null,null,null,null,null,null,null,null,null,null,null,null,null,null,null,null,null,null,null,null,null,null,null,null,null,null,null,null,null,null,null,null,null,null,null,null,null,null,null,null,null,null,null,null,null,null,null,null,null,null,null,null,null,null,null,null,null,null,null,null,"B Parnell"]
["G Waslewski",1.1319999999999999,65,3,null,null,null,null,null,null,null,null,null,null,null,null,null,null,null,null,null,null,null,null,null,null,"Avg WHIP (50)",{"$f":"VLOOKUP(AA1,'Settings & Expansion'!M3:P137,4,FALSE)","v":1.2605}]
["D Hamilton",1.234,53,2,null,null,null,null,null,null,null,null,null,"P","C Hunter",null,null,null,null,null,null,null,null,null,null,null,"Low WHIP (100)",0.84299999999999997]
["D Segui",1.4119999999999999,32,3]
["CATCHERS",null,"Contact","Power","Speed","Def/Arm","Bunt","Raw Avg","Raw Slg%",null,null,null,null,null,null,"IP","H","R","K","ERA",null,null,"BB"]
["D Duncan",null,{"$f":"IF(H14=\"\",\"\",ROUND((50/($AB$3-$AB$2))*(H14-$AB$3)+100,0))","v":36},{"$f":"IF(I14=\"\",\"\",ROUND((50/($AB$7-$AB$6))*(I14-$AB$7)+100,0))","v":58},55,65,60,0.218,0.39200000000000002,null,null,null,null,"Starter","C Hunter",null,null,null,null,{"$f":"IFERROR(IF(O14=\"\",\"\",R14*9/P14),\"INF\")","v":"INF"}]
["G Tenace",null,{"$f":"IF(H15=\"\",\"\",ROUND((50/($AB$3-$AB$2))*(H15-$AB$3)+100,0))","v":40},{"$f":"IF(I15=\"\",\"\",ROUND((50/($AB$7-$AB$6))*(I15-$AB$7)+100,0))","v":47},55,55,55,0.22500000000000001,0.33900000000000002,null,null,null,null,null,null,null,null,null,null,""]
["INFIELDERS",null,"","",null,null,null,null,null,null,null,null,null,null,null,null,null,null,null,""]
["M Epstein",null,65,77,45,20,45,0.27,0.49,null,null,null,null,null,null,null,null,null,null,""]
["T Cullen",null,60,45,60,20,65,0.26100000000000001,0.33100000000000002,null,null,null,null,null,null,null,null,null,null,""]
["B Campaneris",null,48,44,90,20,70,0.24,0.32500000000000001,null,null,null,null,null,null,null,null,null,null,""]
["S Bando",null,46,53,55,20,50,0.23599999999999999,0.36799999999999999,null,null,null,null,null,null,null,null,null,null,""]
["L Brown",null,16,19,60,20,55,0.183,0.19700000000000001,null,null,null,null,null,null,null,null,null,null,{"$f":"IF(O21=\"\",\"\",R21*9/P21)","v":""}]
["T Kubiak",null,15,28,60,20,60,0.18099999999999999,0.245,null,null,null,null,null,null,null,null,null,null,""]
["OUTFIELDERS",null,"",""]
["J Rudi",null,84,76,60,70,40,0.30499999999999999,0.48599999999999999]
["R Jackson",null,62,74,60,55,30,0.26500000000000001,0.47299999999999998]
["A Mangual",null,51,52,55,60,60,0.246,0.36399999999999999]
["M Alou",null,71,49,60,70,55,0.28100000000000003,0.34699999999999998]
["G Hendrick",null,16,40,45,60,65,0.182,0.30599999999999999]
["B Voss",null,41,45,70,60,50,0.22700000000000001,0.33]
[]
[]
[]
[]
[]
[]
[]
[]
[]
[]
[]
[]
[]
[null,null,"AB","H","RBI","Run","HR","3B","2B","SB"]
["PITCHERS",null,0,0,0,0,0,0,0,0]
["C Hunter",null,0,0,0,0,0,0,0,0]
["K Holtzman",1,0,0,0,0,0,0,0,0]
["BM Odom",null,0,0,0,0,0,0,0,0]
["V Blue",null,0,0,0,0,0,0,0,0]
["R Fingers",null,0,0,0,0,0,0,0,0]
["J Horlen",null,0,0,0,0,0,0,0,0]
["B Locker",null,0,0,0,0,0,0,0,0]
["D Knowles",null,0,0,0,0,0,0,0,0]
["G Waslewski",null,0,0,0,0,0,0,0,0]
["D Hamilton",null,0,0,0,0,0,0,0,0]
["D Segui",null,0,0,0,0,0,0,0,0]
["CATCHERS",null,0,0,0,0,0,0,0,0]
["D Duncan",1,0,0,0,0,0,0,0,0]
["G Tenace",null,0,0,0,0,0,0,0,0]
["INFIELDERS",null,0,0,0,0,0,0,0,0]
["M Epstein",1,0,0,0,0,0,0,0,0]
["T Cullen",1,0,0,0,0,0,0,0,0]
["B Campaneris",1,0,0,0,0,0,0,0,0]
["S Bando",1,0,0,0,0,0,0,0,0]
["L Brown",null,0,0,0,0,0,0,0,0]
["T Kubiak",null,0,0,0,0,0,0,0,0]
["OUTFIELDERS",null,0,0,0,0,0,0,0,0]
["J Rudi",1,0,0,0,0,0,0,0,0]
["R Jackson",1,0,0,0,0,0,0,0,0]
["A Mangual",null,0,0,0,0,0,0,0,0]
["M Alou",1,0,0,0,0,0,0,0,0]
["G Hendrick",null,0,0,0,0,0,0,0,0]
["B Voss",null,0,0,0,0,0,0,0,0]
[null,99,0,0,0,0,0,0,0,0]

{"sheet":"1971Pirates","index":18,"n_rows":73,"n_cols":406,"rows_kept":73,"cut":false,"hidden":false,"merged":[[0,26,0,27]]}
["PITCHERS","WHIP","Effectiveness","Stamina",1,"2B","D Cash",null,1,"S Blass",null,null,1,"2B","D Cash",null,null,null,null,null,null,null,null,null,null,null,1971]
["S Blass",1.2250000000000001,{"$f":"IF(B2=\"\",\"\",ROUND((50/($AB$11-$AB$10))*(B2-$AB$11)+100,0))","v":59},1,2,"CF","G Clines",null,2,"D Ellis",null,null,2,"CF","G Clines",null,null,null,null,null,null,null,null,null,null,null,"Avg BA (50)",{"$f":"VLOOKUP(AA1,'Settings & Expansion'!M3:P137,2,FALSE)","v":0.2495}]
["D Ellis",1.1910000000000001,{"$f":"IF(B3=\"\",\"\",ROUND((50/($AB$11-$AB$10))*(B3-$AB$11)+100,0))","v":63},1,3,"RF","R Clemente",null,3,"B Johnson",null,null,3,"RF","R Clemente",null,null,null,null,null,null,null,null,null,null,null,"Top BA (100)",0.36299999999999999]
["B Johnson",1.288,51,1,4,"1B","B Robertson",null,4,"L Walker",null,null,4,"1B","B Robertson"]
["L Walker",1.3149999999999999,48,1,5,"C","M Sanguillen",null,null,null,null,null,5,"C","M Sanguillen"]
["D Giusti",1.2789999999999999,52,3,6,"LF","W Stargell",null,null,null,null,null,6,"LF","W Stargell",null,null,null,null,null,null,null,null,null,null,null,"Avg Slg% (50)",{"$f":"VLOOKUP(AA1,'Settings & Expansion'!M3:P137,3,FALSE)","v":0.36499999999999999}]
["N Briles",1.2210000000000001,59,2,7,"3B","J Pagan",null,null,null,null,null,7,"3B","J Pagan",null,null,null,null,null,null,null,null,null,null,null,"Top Slg% (100)",0.66900000000000004]
["M Grant",1.427,34,3,8,"SS","J Hernandez",null,null,null,null,null,8,"SS","J Hernandez"]
["B Veale",1.7909999999999999,-12,3,9,"P","S Blass",null,null,null,null,null,9,"P","S Blass",null,null,null,null,null,null,null,null,null,null,null,null,null,null,null,null,null,null,null,null,null,null,null,null,null,null,null,null,null,null,null,null,null,null,null,null,null,null,null,null,null,null,null,null,null,null,null,null,null,null,null,null,null,null,null,null,null,null,null,null,null,null,null,null,null,null,null,null,null,null,null,null,null,null,null,null,null,null,null,null,null,null,null,null,null,null,null,null,null,null,null,null,null,null,null,null,null,null,null,null,null,null,null,null,null,null,null,null,null,null,null,null,null,null,null,null,null,null,null,null,null,null,null,null,null,null,null,null,null,null,null,null,null,null,null,null,null,null,null,null,null,null,null,null,null,null,null,null,null,null,null,null,null,null,null,null,null,null,null,null,null,null,null,null,null,null,null,null,null,null,null,null,null,null,null,null,null,null,null,null,null,null,null,null,null,null,null,null,null,null,null,null,null,null,null,null,null,null,null,null,null,null,null,null,null,null,null,null,null,null,null,null,null,null,null,null,null,null,null,null,null,null,null,null,null,null,null,null,null,null,null,null,null,null,null,null,null,null,null,null,null,null,null,null,null,null,null,null,null,null,null,null,null,null,null,null,null,null,null,null,null,null,null,null,null,null,null,null,null,null,null,null,null,null,null,null,null,null,null,null,null,null,null,null,null,null,null,null,null,null,null,null,null,null,null,null,null,null,null,null,null,null,null,null,null,null,null,null,null,null,null,null,null,null,null,null,null,null,null,null,null,null,null,null,null,null,null,null,null,null,null,null,null,null,null,null,null,null,null,null,null,null,null,null,null,null,null,null,null,null,null,null,null,null,null,null,null,null,null,null,null,null,null,null,null,null,null,null,null,null,null,null,null,null,null,null,null,null,null,null,null,null,null,null,null,null,null,null,null,null,"T Clippard"]
["J Nelson",1.5289999999999999,21,3,null,null,null,null,null,null,null,null,null,null,null,null,null,null,null,null,null,null,null,null,null,null,"Avg WHIP (50)",{"$f":"VLOOKUP(AA1,'Settings & Expansion'!M3:P137,4,FALSE)","v":1.2965}]
["B Moose",1.4570000000000001,30,2,null,null,null,null,null,null,null,null,null,"P","S Blass",null,null,null,null,null,null,null,null,null,null,null,"Low WHIP (100)",0.89600000000000002]
["B Kison",1.353,43,2]
["CATCHERS",null,"Contact","Power","Speed","Def/Arm","Bunt","Raw Avg","Raw Slg%",null,null,null,null,null,null,"IP","H","R","K","ERA",null,null,"BB"]
["M Sanguillen",null,{"$f":"IF(H14=\"\",\"\",ROUND((50/($AB$3-$AB$2))*(H14-$AB$3)+100,0))","v":81},{"$f":"IF(I14=\"\",\"\",ROUND((50/($AB$7-$AB$6))*(I14-$AB$7)+100,0))","v":60},65,80,60,0.31900000000000001,0.42599999999999999,null,null,null,null,"Starter","S Blass",{"$f":"ROUND(6.33333333333333,2)","v":6.33},7,3,3,{"$f":"ROUND(4.2654028436019,2)","v":4.2699999999999996},null,null,2,0,0,0]
["M May",null,{"$f":"IF(H15=\"\",\"\",ROUND((50/($AB$3-$AB$2))*(H15-$AB$3)+100,0))","v":63},{"$f":"IF(I15=\"\",\"\",ROUND((50/($AB$7-$AB$6))*(I15-$AB$7)+100,0))","v":61},50,60,40,0.27800000000000002,0.42899999999999999,null,null,null,null,null,"D Ellis",{"$f":"ROUND(0.666666666666667,2)","v":0.67},0,0,0,{"$f":"ROUND(0,2)","v":0},null,null,0,0,0,0]
["INFIELDERS",null,"","",null,null,null,null,null,null,null,null,null,null,"B Johnson",{"$f":"ROUND(1,2)","v":1},0,0,1,{"$f":"ROUND(0,2)","v":0},"W",null,0,0,0,0]
["B Robertson",null,59,70,40,20,35,0.27100000000000002,0.48399999999999999,null,null,null,null,null,"L Walker",{"$f":"ROUND(1,2)","v":1},1,0,0,{"$f":"ROUND(0,2)","v":0},null,"S",0,0,0,0]
["D Cash",null,67,48,70,20,65,0.28899999999999998,0.35399999999999998,null,null,null,null,null,null,null,null,null,null,{"$f":"IFERROR(IF(O18=\"\",\"\",R18*9/P18),\"INF\")","v":""}]
["G Alley",null,40,46,60,20,70,0.22700000000000001,0.34200000000000003,null,null,null,null,null,null,null,null,null,null,""]
["R Hebner",null,59,70,50,20,45,0.27100000000000002,0.48699999999999999,null,null,null,null,null,null,null,null,null,null,""]
["J Hernandez",null,31,39,55,20,60,0.20599999999999999,0.3,null,null,null,null,null,null,null,null,null,null,{"$f":"IF(O21=\"\",\"\",R21*9/P21)","v":""}]
["B Mazeroski",null,52,38,40,20,65,0.254,0.29499999999999998,null,null,null,null,null,null,null,null,null,null,""]
["J Pagan",null,46,46,55,20,60,0.24099999999999999,0.34200000000000003]
["OUTFIELDERS",null,"",""]
["W Stargell",null,70,93,40,60,40,0.29499999999999998,0.628]
["A Oliver",null,64,63,60,70,55,0.28199999999999997,0.44600000000000001]
["R Clemente",null,90,73,75,90,70,0.34100000000000003,0.502]
["V Davalillo",null,66,53,70,60,60,0.28499999999999998,0.38300000000000001]
["G Clines",null,76,54,70,60,65,0.308,0.39200000000000002]
[]
[]
[]
[]
[]
[]
[]
[]
[]
[]
[]
[]
[]
[null,null,"AB","H","RBI","Run","HR","3B","2B","SB"]
["PITCHERS",null,0,0,0,0,0,0,0,0]
["S Blass",1,0,0,0,1,0,0,0,0]
["D Ellis",null,0,0,0,0,0,0,0,0]
["B Johnson",null,0,0,0,0,0,0,0,0]
["L Walker",null,0,0,0,0,0,0,0,0]
["D Giusti",null,0,0,0,0,0,0,0,0]
["N Briles",1,0,0,0,0,0,0,0,0]
["M Grant",1,0,0,0,0,0,0,0,0]
["B Veale",null,0,0,0,0,0,0,0,0]
["J Nelson",null,0,0,0,0,0,0,0,0]
["B Moose",1,0,0,0,0,0,0,0,0]
["B Kison",null,0,0,0,0,0,0,0,0]
["CATCHERS",null,0,0,0,0,0,0,0,0]
["M Sanguillen",1,3,1,0,0,0,0,0,0]
["M May",null,0,0,0,0,0,0,0,0]
["INFIELDERS",null,0,0,0,0,0,0,0,0]
["B Robertson",1,4,2,2,1,1,0,0,0]
["D Cash",1,1,0,0,0,0,0,0,0]
["G Alley",1,3,0,0,0,0,0,0,0]
["R Hebner",1,4,0,0,0,0,0,0,0]
["J Hernandez",1,4,1,1,1,0,0,1,0]
["B Mazeroski",null,0,0,0,0,0,0,0,0]
["J Pagan",null,0,0,0,0,0,0,0,0]
["OUTFIELDERS",1,4,1,1,1,1,0,0,0]
["W Stargell",1,4,1,0,0,0,0,1,0]
["A Oliver",1,4,0,0,0,0,0,0,0]
["R Clemente",null,0,0,0,0,0,0,0,0]
["V Davalillo",null,0,0,0,0,0,0,0,0]
["G Clines",null,0,0,0,0,0,0,0,0]
[null,99,0,0,0,0,0,0,0,0]

{"sheet":"1970Orioles","index":19,"n_rows":73,"n_cols":406,"rows_kept":73,"cut":false,"hidden":false,"merged":[[0,26,0,27]]}
["PITCHERS","WHIP","Effectiveness","Stamina",1,"LF","D Buford",null,1,"J Palmer",null,null,1,"LF","D Buford",null,null,null,null,null,null,null,null,null,null,null,1970]
["J Palmer",1.19,{"$f":"IF(B2=\"\",\"\",ROUND((50/($AB$11-$AB$10))*(B2-$AB$11)+100,0))","v":69},1,2,"CF","P Blair",null,2,"M Cuellar",null,null,2,"CF","P Blair",null,null,null,null,null,null,null,null,null,null,null,"Avg BA (50)",{"$f":"VLOOKUP(AA1,'Settings & Expansion'!M3:P137,2,FALSE)","v":0.254}]
["M Cuellar",1.149,{"$f":"IF(B3=\"\",\"\",ROUND((50/($AB$11-$AB$10))*(B3-$AB$11)+100,0))","v":74},1,3,"1B","B Powell",null,3,"D McNally",null,null,3,"1B","B Powell",null,null,null,null,null,null,null,null,null,null,null,"Top BA (100)",0.36599999999999999]
["D McNally",1.1990000000000001,68,1,4,"RF","F Robinson",null,4,"T Phoebus",null,null,4,"RF","F Robinson"]
["T Phoebus",1.244,63,1,5,"3B","B Robinson",null,null,null,null,null,5,"3B","B Robinson"]
["P Reichert",1.0980000000000001,80,3,6,"C","E Hendricks",null,null,null,null,null,6,"C","E Hendricks",null,null,null,null,null,null,null,null,null,null,null,"Avg Slg% (50)",{"$f":"VLOOKUP(AA1,'Settings & Expansion'!M3:P137,3,FALSE)","v":0.38550000000000001}]
["D Hall",0.92900000000000005,100,3,7,"2B","D Johnson",null,null,null,null,null,7,"2B","D Johnson",null,null,null,null,null,null,null,null,null,null,null,"Top Slg% (100)",0.61199999999999999]
["M Lopez",1.385,47,2,8,"SS","M Belanger",null,null,null,null,null,8,"SS","M Belanger"]
["E Watt",1.319,54,3,9,"P","J Palmer",null,null,null,null,null,9,"P","D Hall",null,null,null,null,null,null,null,null,null,null,null,null,null,null,null,null,null,null,null,null,null,null,null,null,null,null,null,null,null,null,null,null,null,null,null,null,null,null,null,null,null,null,null,null,null,null,null,null,null,null,null,null,null,null,null,null,null,null,null,null,null,null,null,null,null,null,null,null,null,null,null,null,null,null,null,null,null,null,null,null,null,null,null,null,null,null,null,null,null,null,null,null,null,null,null,null,null,null,null,null,null,null,null,null,null,null,null,null,null,null,null,null,null,null,null,null,null,null,null,null,null,null,null,null,null,null,null,null,null,null,null,null,null,null,null,null,null,null,null,null,null,null,null,null,null,null,null,null,null,null,null,null,null,null,null,null,null,null,null,null,null,null,null,null,null,null,null,null,null,null,null,null,null,null,null,null,null,null,null,null,null,null,null,null,null,null,null,null,null,null,null,null,null,null,null,null,null,null,null,null,null,null,null,null,null,null,null,null,null,null,null,null,null,null,null,null,null,null,null,null,null,null,null,null,null,null,null,null,null,null,null,null,null,null,null,null,null,null,null,null,null,null,null,null,null,null,null,null,null,null,null,null,null,null,null,null,null,null,null,null,null,null,null,null,null,null,null,null,null,null,null,null,null,null,null,null,null,null,null,null,null,null,null,null,null,null,null,null,null,null,null,null,null,null,null,null,null,null,null,null,null,null,null,null,null,null,null,null,null,null,null,null,null,null,null,null,null,null,null,null,null,null,null,null,null,null,null,null,null,null,null,null,null,null,null,null,null,null,null,null,null,null,null,null,null,null,null,null,null,null,null,null,null,null,null,null,null,null,null,null,null,null,null,null,null,null,null,null,null,null,null,null,null,null,null,null,null,null,null,null,null,null,null,null,null,null,null,null,null,null,"P Reichert"]
["D Leonhard",1.7649999999999999,2,3,null,null,null,null,null,null,null,null,null,null,null,null,null,null,null,null,null,null,null,null,null,null,"Avg WHIP (50)",{"$f":"VLOOKUP(AA1,'Settings & Expansion'!M3:P137,4,FALSE)","v":1.3559999999999999}]
["J Hardin",1.2110000000000001,67,2,null,null,null,null,null,null,null,null,null,"P","D Hall",null,null,null,null,null,null,null,null,null,null,null,"Low WHIP (100)",0.92900000000000005]
["M Drabowsky",1.35,51,3]
["CATCHERS",null,"Contact","Power","Speed","Def/Arm","Bunt","Raw Avg","Raw Slg%",null,null,null,null,null,null,"IP","H","R","K","ERA",null,null,"BB"]
["E Hendricks",null,{"$f":"IF(H14=\"\",\"\",ROUND((50/($AB$3-$AB$2))*(H14-$AB$3)+100,0))","v":45},{"$f":"IF(I14=\"\",\"\",ROUND((50/($AB$7-$AB$6))*(I14-$AB$7)+100,0))","v":49},55,85,40,0.24199999999999999,0.38200000000000001,null,null,null,null,"Starter","T Phoebus",{"$f":"ROUND(6.66666666666666,2)","v":6.67},5,1,5,{"$f":"ROUND(1.34932533733133,2)","v":1.35},"W",null,4,0,0,0]
["A Etchebarren",null,{"$f":"IF(H15=\"\",\"\",ROUND((50/($AB$3-$AB$2))*(H15-$AB$3)+100,0))","v":45},{"$f":"IF(I15=\"\",\"\",ROUND((50/($AB$7-$AB$6))*(I15-$AB$7)+100,0))","v":42},45,60,55,0.24299999999999999,0.34799999999999998,null,null,null,null,null,"P Reichert",{"$f":"ROUND(0.333333333333333,2)","v":0.33},0,0,0,{"$f":"ROUND(0,2)","v":0},null,null,1,0,0,0]
["INFIELDERS",null,"","",null,null,null,null,null,null,null,null,null,null,"E Watt",{"$f":"ROUND(0.666666666666667,2)","v":0.67},0,0,1,{"$f":"ROUND(0,2)","v":0},null,null,0,0,0,0]
["B Powell",null,69,86,30,20,25,0.29699999999999999,0.54900000000000004,null,null,null,null,null,"D Hall",{"$f":"ROUND(1,2)","v":1},1,1,1,{"$f":"ROUND(9,2)","v":9},null,null,0,0,0,0]
["D Johnson",null,62,51,60,20,70,0.28100000000000003,0.39200000000000002,null,null,null,null,null,null,null,null,null,null,{"$f":"IFERROR(IF(O18=\"\",\"\",R18*9/P18),\"INF\")","v":""}]
["M Belanger",null,34,22,65,20,65,0.218,0.25900000000000001,null,null,null,null,null,null,null,null,null,null,{"$f":"IFERROR(IF(O19=\"\",\"\",R19*9/P19),\"INF\")","v":""}]
["B Robinson",null,60,60,55,20,60,0.27600000000000002,0.42899999999999999,null,null,null,null,null,null,null,null,null,null,{"$f":"IFERROR(IF(O20=\"\",\"\",R20*9/P20),\"INF\")","v":""}]
["T Crowley",null,51,51,55,45,40,0.25700000000000001,0.38800000000000001,null,null,null,null,null,null,null,null,null,null,{"$f":"IF(O21=\"\",\"\",R21*9/P21)","v":""}]
["C Salmon",null,48,52,55,20,60,0.25,0.39500000000000002,null,null,null,null,null,null,null,null,null,null,""]
["OUTFIELDERS",null,"",""]
["D Buford",null,58,56,70,70,65,0.27200000000000002,0.41099999999999998]
["P Blair",null,56,62,80,75,65,0.26700000000000002,0.438]
["F Robinson",null,73,80,55,65,40,0.30599999999999999,0.52]
["M Rettenmund",null,80,85,70,55,55,0.32200000000000001,0.54400000000000004]
["C Motton",null,38,52,60,60,55,0.22600000000000001,0.39300000000000002]
["D Baylor",null,42,17,55,55,50,0.23499999999999999,0.23499999999999999]
[]
[]
[]
[]
[]
[]
[]
[]
[]
[]
[]
[]
[]
[null,null,"AB","H","RBI","Run","HR","3B","2B","SB"]
["PITCHERS",null,0,0,0,0,0,0,0,0]
["J Palmer",null,0,0,0,0,0,0,0,0]
["M Cuellar",null,0,0,0,0,0,0,0,0]
["D McNally",null,0,0,0,0,0,0,0,0]
["T Phoebus",1,4,2,1,1,0,0,0,0]
["P Reichert",1,0,0,0,0,0,0,0,0]
["D Hall",1,0,0,0,0,0,0,0,0]
["M Lopez",null,0,0,0,0,0,0,0,0]
["E Watt",1,0,0,0,0,0,0,0,0]
["D Leonhard",null,0,0,0,0,0,0,0,0]
["J Hardin",null,0,0,0,0,0,0,0,0]
["M Drabowsky",null,0,0,0,0,0,0,0,0]
["CATCHERS",null,0,0,0,0,0,0,0,0]
["E Hendricks",1,3,2,1,2,0,0,0,0]
["A Etchebarren",null,0,0,0,0,0,0,0,0]
["INFIELDERS",null,0,0,0,0,0,0,0,0]
["B Powell",1,3,2,2,1,0,0,1,0]
["D Johnson",1,5,1,0,1,0,0,1,0]
["M Belanger",1,4,2,3,1,0,0,1,0]
["B Robinson",1,5,1,1,1,0,0,1,0]
["T Crowley",null,0,0,0,0,0,0,0,0]
["C Salmon",null,0,0,0,0,0,0,0,0]
["OUTFIELDERS",null,0,0,0,0,0,0,0,0]
["D Buford",1,5,0,0,0,0,0,0,0]
["P Blair",1,5,2,2,2,1,0,1,0]
["F Robinson",1,5,2,0,1,0,0,1,0]
["M Rettenmund",null,0,0,0,0,0,0,0,0]
["C Motton",null,0,0,0,0,0,0,0,0]
["D Baylor",null,0,0,0,0,0,0,0,0]
[null,99,0,0,0,0,0,0,0,0]

{"sheet":"1969Mets","index":20,"n_rows":73,"n_cols":28,"rows_kept":73,"cut":false,"hidden":false,"merged":[[0,26,0,27]]}
["PITCHERS","WHIP","Effectiveness","Stamina",1,"CF","T Agee",null,1,"T Seaver",null,null,1,"CF","T Agee",null,null,null,null,null,null,null,null,null,null,null,1969]
["T Seaver",1.0389999999999999,{"$f":"IF(B2=\"\",\"\",ROUND((50/($AB$11-$AB$10))*(B2-$AB$11)+100,0))","v":82},1,2,"SS","B Harrelson",null,2,"J Koosman",null,null,2,"SS","B Harrelson",null,null,null,null,null,null,null,null,null,null,null,"Avg BA (50)",{"$f":"VLOOKUP(AA1,'Settings & Expansion'!M3:P137,2,FALSE)","v":0.248}]
["J Koosman",1.0580000000000001,{"$f":"IF(B3=\"\",\"\",ROUND((50/($AB$11-$AB$10))*(B3-$AB$11)+100,0))","v":80},1,3,"LF","C Jones",null,3,"G Gentry",null,null,3,"LF","C Jones",null,null,null,null,null,null,null,null,null,null,null,"Top BA (100)",0.34799999999999998]
["G Gentry",1.1679999999999999,67,1,4,"1B","D Clendenon",null,4,"D Cardwell",null,null,4,"1B","D Clendenon"]
["D Cardwell",1.26,57,1,5,"RF","R Swoboda",null,null,null,null,null,5,"RF","R Swoboda"]
["R Taylor",1.1180000000000001,73,3,6,"3B","W Garrett",null,null,null,null,null,6,"3B","W Garrett",null,null,null,null,null,null,null,null,null,null,null,"Avg Slg% (50)",{"$f":"VLOOKUP(AA1,'Settings & Expansion'!M3:P137,3,FALSE)","v":0.36899999999999999}]
["T McGraw",1.355,46,2,7,"C","J Grote",null,null,null,null,null,7,"C","J Grote",null,null,null,null,null,null,null,null,null,null,null,"Top Slg% (100)",0.65600000000000003]
["N Ryan",1.2649999999999999,56,2,8,"2B","K Boswell",null,null,null,null,null,8,"2B","K Boswell"]
["C Koonce",1.53,26,2,9,"P","T Seaver",null,null,null,null,null,9,"P","T Seaver"]
["J DiLauro",1.0680000000000001,79,3,null,null,null,null,null,null,null,null,null,null,null,null,null,null,null,null,null,null,null,null,null,null,"Avg WHIP (50)",{"$f":"VLOOKUP(AA1,'Settings & Expansion'!M3:P137,4,FALSE)","v":1.319}]
["J McAndrew",1.1559999999999999,69,2,null,null,null,null,null,null,null,null,null,"P","T Seaver",null,null,null,null,null,null,null,null,null,null,null,"Low WHIP (100)",0.88300000000000001]
["A Jackson",2,-28,3]
["CATCHERS",null,"Contact","Power","Speed","Def/Arm","Bunt","Raw Avg","Raw Slg%",null,null,null,null,null,null,"IP","H","R","K","ERA",null,null,"BB"]
["J Grote",null,{"$f":"IF(H14=\"\",\"\",ROUND((50/($AB$3-$AB$2))*(H14-$AB$3)+100,0))","v":52},{"$f":"IF(I14=\"\",\"\",ROUND((50/($AB$7-$AB$6))*(I14-$AB$7)+100,0))","v":47},45,85,60,0.252,0.35099999999999998,null,null,null,null,"Starter","T Seaver",null,null,null,null,{"$f":"IFERROR(IF(O14=\"\",\"\",R14*9/P14),\"INF\")","v":"INF"}]
["J Martin",null,{"$f":"IF(H15=\"\",\"\",ROUND((50/($AB$3-$AB$2))*(H15-$AB$3)+100,0))","v":31},{"$f":"IF(I15=\"\",\"\",ROUND((50/($AB$7-$AB$6))*(I15-$AB$7)+100,0))","v":41},50,60,45,0.20899999999999999,0.316,null,null,null,null,null,null,null,null,null,null,""]
["INFIELDERS",null,"","",null,null,null,null,null,null,null,null,null,null,null,null,null,null,null,""]
["E Kranepool",null,45,50,45,20,50,0.23799999999999999,0.36799999999999999,null,null,null,null,null,null,null,null,null,null,""]
["K Boswell",null,66,52,60,20,65,0.27900000000000003,0.38100000000000001,null,null,null,null,null,null,null,null,null,null,""]
["B Harrelson",null,50,39,55,20,55,0.248,0.30599999999999999,null,null,null,null,null,null,null,null,null,null,""]
["W Garrett",null,35,32,65,20,70,0.218,0.26800000000000002,null,null,null,null,null,null,null,null,null,null,""]
["A Weis",null,34,36,60,20,65,0.215,0.29099999999999998,null,null,null,null,null,null,null,null,null,null,{"$f":"IF(O21=\"\",\"\",R21*9/P21)","v":""}]
["D Clendenon",null,52,65,60,20,40,0.252,0.45500000000000002,null,null,null,null,null,null,null,null,null,null,""]
["OUTFIELDERS",null,"",""]
["C Jones",null,96,70,70,70,60,0.34,0.48199999999999998]
["T Agee",null,62,67,70,75,65,0.27100000000000002,0.46400000000000002]
["R Swoboda",null,44,49,55,65,55,0.23499999999999999,0.36099999999999999]
["A Shamsky",null,76,71,60,55,40,0.3,0.48799999999999999]
["R Gaspar",null,40,34,55,60,70,0.22800000000000001,0.27900000000000003]
["A Otis",null,1,21,70,60,70,0.151,0.20399999999999999]
[]
[]
[]
[]
[]
[]
[]
[]
[]
[]
[]
[]
[]
[null,null,"AB","H","RBI","Run","HR","3B","2B","SB"]
["PITCHERS",null,0,0,0,0,0,0,0,0]
["T Seaver",null,0,0,0,0,0,0,0,0]
["J Koosman",null,0,0,0,0,0,0,0,0]
["G Gentry",1,0,0,0,0,0,0,0,0]
["D Cardwell",null,0,0,0,0,0,0,0,0]
["R Taylor",null,0,0,0,0,0,0,0,0]
["T McGraw",null,0,0,0,0,0,0,0,0]
["N Ryan",null,0,0,0,0,0,0,0,0]
["C Koonce",null,0,0,0,0,0,0,0,0]
["J DiLauro",null,0,0,0,0,0,0,0,0]
["J McAndrew",null,0,0,0,0,0,0,0,0]
["A Jackson",null,0,0,0,0,0,0,0,0]
["CATCHERS",null,0,0,0,0,0,0,0,0]
["J Grote",1,0,0,0,0,0,0,0,0]
["J Martin",null,0,0,0,0,0,0,0,0]
["INFIELDERS",null,0,0,0,0,0,0,0,0]
["E Kranepool",1,0,0,0,0,0,0,0,0]
["K Boswell",1,0,0,0,0,0,0,0,0]
["B Harrelson",null,0,0,0,0,0,0,0,0]
["W Garrett",null,0,0,0,0,0,0,0,0]
["A Weis",1,0,0,0,0,0,0,0,0]
["D Clendenon",1,0,0,0,0,0,0,0,0]
["OUTFIELDERS",null,0,0,0,0,0,0,0,0]
["C Jones",1,0,0,0,0,0,0,0,0]
["T Agee",1,0,0,0,0,0,0,0,0]
["R Swoboda",1,0,0,0,0,0,0,0,0]
["A Shamsky",null,0,0,0,0,0,0,0,0]
["R Gaspar",null,0,0,0,0,0,0,0,0]
["A Otis",null,0,0,0,0,0,0,0,0]
[null,99,0,0,0,0,0,0,0,0]

{"sheet":"1968Tigers","index":21,"n_rows":73,"n_cols":28,"rows_kept":73,"cut":false,"hidden":false,"merged":[[0,26,0,27]]}
["PITCHERS","WHIP","Effectiveness","Stamina",1,"2B","D McAuliffe",null,1,"D McLain",null,null,1,"2B","D McAuliffe",null,null,null,null,null,null,null,null,null,null,null,1968]
["D McLain",0.90500000000000003,{"$f":"IF(B2=\"\",\"\",ROUND((50/($AB$11-$AB$10))*(B2-$AB$11)+100,0))","v":91},1,2,"SS","M Stanley",null,2,"M Lolich",null,null,2,"SS","M Stanley",null,null,null,null,null,null,null,null,null,null,null,"Avg BA (50)",{"$f":"VLOOKUP(AA1,'Settings & Expansion'!M3:P137,2,FALSE)","v":0.23649999999999999}]
["M Lolich",1.105,{"$f":"IF(B3=\"\",\"\",ROUND((50/($AB$11-$AB$10))*(B3-$AB$11)+100,0))","v":63},1,3,"RF","A Kaline",null,3,"E Wilson",null,null,3,"RF","A Kaline",null,null,null,null,null,null,null,null,null,null,null,"Top BA (100)",0.33500000000000002]
["E Wilson",1.1459999999999999,57,1,4,"1B","N Cash",null,4,"J Sparma",null,null,4,"1B","N Cash"]
["J Sparma",1.349,28,1,5,"LF","W Horton",null,null,null,null,null,5,"LF","W Horton"]
["P Dobson",1.0960000000000001,64,2,6,"CF","J Northrup",null,null,null,null,null,6,"CF","J Northrup",null,null,null,null,null,null,null,null,null,null,null,"Avg Slg% (50)",{"$f":"VLOOKUP(AA1,'Settings & Expansion'!M3:P137,3,FALSE)","v":0.34}]
["J Hiller",1.117,61,2,7,"C","B Freehan",null,null,null,null,null,7,"C","B Freehan",null,null,null,null,null,null,null,null,null,null,null,"Top Slg% (100)",0.55200000000000005]
["D Patterson",1.1759999999999999,52,2,8,"3B","D Wert",null,null,null,null,null,8,"3B","D Wert"]
["F Lasher",1.212,47,3,9,"P","D McLain",null,null,null,null,null,9,"P","D McLain"]
["J Warden",1.2050000000000001,48,3,null,null,null,null,null,null,null,null,null,null,null,null,null,null,null,null,null,null,null,null,null,null,"Avg WHIP (50)",{"$f":"VLOOKUP(AA1,'Settings & Expansion'!M3:P137,4,FALSE)","v":1.1930000000000001}]
["D McMahon",0.89700000000000002,92,3,null,null,null,null,null,null,null,null,null,"P","D McLain",null,null,null,null,null,null,null,null,null,null,null,"Low WHIP (100)",0.84199999999999997]
["J Wyatt",1.22,46,3]
["CATCHERS",null,"Contact","Power","Speed","Def/Arm","Bunt","Raw Avg","Raw Slg%",null,null,null,null,null,null,"IP","H","R","K","ERA",null,null,"BB"]
["B Freehan",null,{"$f":"IF(H14=\"\",\"\",ROUND((50/($AB$3-$AB$2))*(H14-$AB$3)+100,0))","v":63},{"$f":"IF(I14=\"\",\"\",ROUND((50/($AB$7-$AB$6))*(I14-$AB$7)+100,0))","v":77},40,65,55,0.26300000000000001,0.45400000000000001,null,null,null,null,"Starter","D McLain",null,null,null,null,{"$f":"IFERROR(IF(O14=\"\",\"\",R14*9/P14),\"INF\")","v":"INF"}]
["J Price",null,{"$f":"IF(H15=\"\",\"\",ROUND((50/($AB$3-$AB$2))*(H15-$AB$3)+100,0))","v":18},{"$f":"IF(I15=\"\",\"\",ROUND((50/($AB$7-$AB$6))*(I15-$AB$7)+100,0))","v":34},45,55,60,0.17399999999999999,0.27300000000000002,null,null,null,null,null,null,null,null,null,null,""]
["INFIELDERS",null,"","",null,null,null,null,null,null,null,null,null,null,null,null,null,null,null,""]
["N Cash",null,63,85,45,20,40,0.26300000000000001,0.48699999999999999,null,null,null,null,null,null,null,null,null,null,""]
["D McAuliffe",null,56,67,70,20,70,0.249,0.41099999999999998,null,null,null,null,null,null,null,null,null,null,""]
["R Oyler",null,-2,14,50,20,55,0.13500000000000001,0.186,null,null,null,null,null,null,null,null,null,null,""]
["D Wert",null,31,40,60,20,65,0.2,0.29899999999999999,null,null,null,null,null,null,null,null,null,null,""]
["T Matchick",null,33,37,60,20,60,0.20300000000000001,0.28599999999999998,null,null,null,null,null,null,null,null,null,null,{"$f":"IF(O21=\"\",\"\",R21*9/P21)","v":""}]
["D Tracewski",null,9,25,65,20,60,0.156,0.23599999999999999,null,null,null,null,null,null,null,null,null,null,""]
["OUTFIELDERS",null,"",""]
["W Horton",null,75,98,50,60,45,0.28499999999999998,0.54300000000000004]
["M Stanley",null,61,56,65,65,65,0.25900000000000001,0.36399999999999999]
["J Northrup",null,64,75,60,65,50,0.26400000000000001,0.44700000000000001]
["A Kaline",null,76,71,65,75,55,0.28699999999999998,0.42799999999999999]
["G Brown",null,118,131,45,55,35,0.37,0.68500000000000005]
["W Comer",null,-7,24,60,60,65,0.125,0.22900000000000001]
[]
[]
[]
[]
[]
[]
[]
[]
[]
[]
[]
[]
[]
[null,null,"AB","H","RBI","Run","HR","3B","2B","SB"]
["PITCHERS",null,0,0,0,0,0,0,0,0]
["D McLain",null,0,0,0,0,0,0,0,0]
["M Lolich",null,0,0,0,0,0,0,0,0]
["E Wilson",1,0,0,0,0,0,0,0,0]
["J Sparma",null,0,0,0,0,0,0,0,0]
["P Dobson",null,0,0,0,0,0,0,0,0]
["J Hiller",null,0,0,0,0,0,0,0,0]
["D Patterson",null,0,0,0,0,0,0,0,0]
["F Lasher",null,0,0,0,0,0,0,0,0]
["J Warden",null,0,0,0,0,0,0,0,0]
["D McMahon",null,0,0,0,0,0,0,0,0]
["J Wyatt",null,0,0,0,0,0,0,0,0]
["CATCHERS",null,0,0,0,0,0,0,0,0]
["B Freehan",1,0,0,0,0,0,0,0,0]
["J Price",null,0,0,0,0,0,0,0,0]
["INFIELDERS",null,0,0,0,0,0,0,0,0]
["N Cash",1,0,0,0,0,0,0,0,0]
["D McAuliffe",1,0,0,0,0,0,0,0,0]
["R Oyler",1,0,0,0,0,0,0,0,0]
["D Wert",1,0,0,0,0,0,0,0,0]
["T Matchick",null,0,0,0,0,0,0,0,0]
["D Tracewski",null,0,0,0,0,0,0,0,0]
["OUTFIELDERS",null,0,0,0,0,0,0,0,0]
["W Horton",1,0,0,0,0,0,0,0,0]
["M Stanley",1,0,0,0,0,0,0,0,0]
["J Northrup",1,0,0,0,0,0,0,0,0]
["A Kaline",null,0,0,0,0,0,0,0,0]
["G Brown",null,0,0,0,0,0,0,0,0]
["W Comer",null,0,0,0,0,0,0,0,0]
[null,99,0,0,0,0,0,0,0,0]

{"sheet":"1967Cardinals","index":22,"n_rows":73,"n_cols":406,"rows_kept":73,"cut":false,"hidden":false,"merged":[[0,26,0,27]]}
["PITCHERS","WHIP","Effectiveness","Stamina",1,"LF","L Brock",null,1,"D Hughes",null,null,1,"LF","L Brock",null,null,null,null,null,null,null,null,null,null,null,1967]
["D Hughes",0.95399999999999996,{"$f":"IF(B2=\"\",\"\",ROUND((50/($AB$11-$AB$10))*(B2-$AB$11)+100,0))","v":100},1,2,"CF","C Flood",null,2,"S Carlton",null,null,2,"CF","C Flood",null,null,null,null,null,null,null,null,null,null,null,"Avg BA (50)",{"$f":"VLOOKUP(AA1,'Settings & Expansion'!M3:P137,2,FALSE)","v":0.24249999999999999}]
["S Carlton",1.218,{"$f":"IF(B3=\"\",\"\",ROUND((50/($AB$11-$AB$10))*(B3-$AB$11)+100,0))","v":54},1,3,"RF","R Maris",null,3,"R Washburn",null,null,3,"RF","R Maris",null,null,null,null,null,null,null,null,null,null,null,"Top BA (100)",0.35699999999999998]
["R Washburn",1.2450000000000001,49,1,4,"1B","O Cepeda",null,4,"B Gibson",null,null,4,"1B","O Cepeda"]
["B Gibson",1.089,76,1,5,"C","T McCarver",null,null,null,null,null,5,"C","T McCarver"]
["J Hoerner",1.091,76,3,6,"3B","M Shannon",null,null,null,null,null,6,"3B","M Shannon",null,null,null,null,null,null,null,null,null,null,null,"Avg Slg% (50)",{"$f":"VLOOKUP(AA1,'Settings & Expansion'!M3:P137,3,FALSE)","v":0.35699999999999998}]
["N Briles",1.1519999999999999,65,2,7,"2B","J Javier",null,null,null,null,null,7,"2B","J Javier",null,null,null,null,null,null,null,null,null,null,null,"Top Slg% (100)",0.622]
["A Jackson",1.3640000000000001,28,2,8,"S","D Maxvill",null,null,null,null,null,8,"S","D Maxvill"]
["R Willis",1.4690000000000001,9,3,9,"P","D Hughes",null,null,null,null,null,9,"P","D Hughes",null,null,null,null,null,null,null,null,null,null,null,null,null,null,null,null,null,null,null,null,null,null,null,null,null,null,null,null,null,null,null,null,null,null,null,null,null,null,null,null,null,null,null,null,null,null,null,null,null,null,null,null,null,null,null,null,null,null,null,null,null,null,null,null,null,null,null,null,null,null,null,null,null,null,null,null,null,null,null,null,null,null,null,null,null,null,null,null,null,null,null,null,null,null,null,null,null,null,null,null,null,null,null,null,null,null,null,null,null,null,null,null,null,null,null,null,null,null,null,null,null,null,null,null,null,null,null,null,null,null,null,null,null,null,null,null,null,null,null,null,null,null,null,null,null,null,null,null,null,null,null,null,null,null,null,null,null,null,null,null,null,null,null,null,null,null,null,null,null,null,null,null,null,null,null,null,null,null,null,null,null,null,null,null,null,null,null,null,null,null,null,null,null,null,null,null,null,null,null,null,null,null,null,null,null,null,null,null,null,null,null,null,null,null,null,null,null,null,null,null,null,null,null,null,null,null,null,null,null,null,null,null,null,null,null,null,null,null,null,null,null,null,null,null,null,null,null,null,null,null,null,null,null,null,null,null,null,null,null,null,null,null,null,null,null,null,null,null,null,null,null,null,null,null,null,null,null,null,null,null,null,null,null,null,null,null,null,null,null,null,null,null,null,null,null,null,null,null,null,null,null,null,null,null,null,null,null,null,null,null,null,null,null,null,null,null,null,null,null,null,null,null,null,null,null,null,null,null,null,null,null,null,null,null,null,null,null,null,null,null,null,null,null,null,null,null,null,null,null,null,null,null,null,null,null,null,null,null,null,null,null,null,null,null,null,null,null,null,null,null,null,null,null,null,null,null,null,null,null,null,null,null,null,null,null,null,null,null,null,null,"J Davis"]
["H Woodeshick",1.6559999999999999,-23,3,null,null,null,null,null,null,null,null,null,null,null,null,null,null,null,null,null,null,null,null,null,null,"Avg WHIP (50)",{"$f":"VLOOKUP(AA1,'Settings & Expansion'!M3:P137,4,FALSE)","v":1.238}]
["L Jaster",1.214,54,2,null,null,null,null,null,null,null,null,null,"P","D Hughes",null,null,null,null,null,null,null,null,null,null,null,"Low WHIP (100)",0.95299999999999996]
["J Lamabe",1.1120000000000001,72,3]
["CATCHERS",null,"Contact","Power","Speed","Def/Arm","Bunt","Raw Avg","Raw Slg%",null,null,null,null,null,null,"IP","H","R","K","ERA",null,null,"BB"]
["T McCarver",null,{"$f":"IF(H14=\"\",\"\",ROUND((50/($AB$3-$AB$2))*(H14-$AB$3)+100,0))","v":73},{"$f":"IF(I14=\"\",\"\",ROUND((50/($AB$7-$AB$6))*(I14-$AB$7)+100,0))","v":68},60,80,60,0.29499999999999998,0.45200000000000001,null,null,null,null,"Starter","D Hughes",null,null,null,null,{"$f":"IFERROR(IF(O14=\"\",\"\",R14*9/P14),\"INF\")","v":"INF"},null,null,null,null,0,0]
["D Ricketts",null,{"$f":"IF(H15=\"\",\"\",ROUND((50/($AB$3-$AB$2))*(H15-$AB$3)+100,0))","v":63},{"$f":"IF(I15=\"\",\"\",ROUND((50/($AB$7-$AB$6))*(I15-$AB$7)+100,0))","v":55},50,55,45,0.27300000000000002,0.38400000000000001,null,null,null,null,null,null,null,null,null,null,"",null,null,null,null,0,0]
["INFIELDERS",null,"","",null,null,null,null,null,null,null,null,null,null,null,null,null,null,null,"",null,null,null,null,0,0]
["O Cepeda",null,86,82,40,20,35,0.32500000000000001,0.52400000000000002,null,null,null,null,null,null,null,null,null,null,""]
["J Javier",null,67,59,60,20,70,0.28100000000000003,0.40400000000000003,null,null,null,null,null,null,null,null,null,null,""]
["D Maxvill",null,43,35,55,20,65,0.22700000000000001,0.27900000000000003,null,null,null,null,null,null,null,null,null,null,""]
["M Shannon",null,51,52,50,20,60,0.245,0.36899999999999999,null,null,null,null,null,null,null,null,null,null,""]
["P Gagliano",null,41,36,50,20,60,0.221,0.28100000000000003,null,null,null,null,null,null,null,null,null,null,{"$f":"IF(O21=\"\",\"\",R21*9/P21)","v":""}]
["E Spiezio",null,36,42,40,20,65,0.21,0.314,null,null,null,null,null,null,null,null,null,null,""]
["E Bressoud",null,3,25,55,20,40,0.13400000000000001,0.224]
["OUTFIELDERS",null,"",""]
["L Brock",null,75,72,85,65,65,0.29899999999999999,0.47199999999999998]
["C Flood",null,90,61,60,75,70,0.33500000000000002,0.41399999999999998]
["R Maris",null,58,59,55,60,35,0.26100000000000001,0.40500000000000003]
["B Tolan",null,55,52,70,60,65,0.253,0.37]
["A Johnson",null,41,42,65,55,55,0.223,0.314]
[]
[]
[]
[]
[]
[]
[]
[]
[]
[]
[]
[]
[]
[null,null,"AB","H","RBI","Run","HR","3B","2B","SB"]
["PITCHERS",null,0,0,0,0,0,0,0,0]
["D Hughes",null,0,0,0,0,0,0,0,0]
["S Carlton",1,0,0,0,0,0,0,0,0]
["R Washburn",null,0,0,0,0,0,0,0,0]
["B Gibson",null,0,0,0,0,0,0,0,0]
["J Hoerner",null,0,0,0,0,0,0,0,0]
["N Briles",null,0,0,0,0,0,0,0,0]
["A Jackson",null,0,0,0,0,0,0,0,0]
["R Willis",null,0,0,0,0,0,0,0,0]
["H Woodeshick",null,0,0,0,0,0,0,0,0]
["L Jaster",null,0,0,0,0,0,0,0,0]
["J Lamabe",null,0,0,0,0,0,0,0,0]
["CATCHERS",null,0,0,0,0,0,0,0,0]
["T McCarver",1,0,0,0,0,0,0,0,0]
["D Ricketts",null,0,0,0,0,0,0,0,0]
["INFIELDERS",null,0,0,0,0,0,0,0,0]
["O Cepeda",1,0,0,0,0,0,0,0,0]
["J Javier",1,0,0,0,0,0,0,0,0]
["D Maxvill",1,0,0,0,0,0,0,0,0]
["M Shannon",1,0,0,0,0,0,0,0,0]
["P Gagliano",null,0,0,0,0,0,0,0,0]
["E Spiezio",null,0,0,0,0,0,0,0,0]
["E Bressoud",null,0,0,0,0,0,0,0,0]
["OUTFIELDERS",null,0,0,0,0,0,0,0,0]
["L Brock",1,0,0,0,0,0,0,0,0]
["C Flood",1,0,0,0,0,0,0,0,0]
["R Maris",1,0,0,0,0,0,0,0,0]
["B Tolan",null,0,0,0,0,0,0,0,0]
["A Johnson",null,0,0,0,0,0,0,0,0]
[null,99,0,0,0,0,0,0,0,0]

{"sheet":"1963Dodgers","index":23,"n_rows":73,"n_cols":28,"rows_kept":73,"cut":false,"hidden":false,"merged":[[0,26,0,27]]}
["PITCHERS","WHIP","Effectiveness","Stamina",1,"SS","M Wills",null,1,"S Koufax",null,null,1,"SS","M Wills",null,null,null,null,null,null,null,null,null,null,null,1963]
["S Koufax",0.875,{"$f":"IF(B2=\"\",\"\",ROUND((50/($AB$11-$AB$10))*(B2-$AB$11)+100,0))","v":100},1,2,"2B","J Gilliam",null,2,"D Drysdale",null,null,2,"2B","J Gilliam",null,null,null,null,null,null,null,null,null,null,null,"Avg BA (50)",{"$f":"VLOOKUP(AA1,'Settings & Expansion'!M3:P137,2,FALSE)","v":0.246}]
["D Drysdale",1.091,{"$f":"IF(B3=\"\",\"\",ROUND((50/($AB$11-$AB$10))*(B3-$AB$11)+100,0))","v":72},1,3,"CF","W Davis",null,3,"J Podres",null,null,3,"CF","W Davis",null,null,null,null,null,null,null,null,null,null,null,"Top BA (100)",0.32600000000000001]
["J Podres",1.3109999999999999,43,1,4,"LF","T Davis",null,4,"B Miller",null,null,4,"LF","T Davis"]
["B Miller",1.262,50,1,5,"RF","F Howard",null,null,null,null,null,5,"RF","F Howard"]
["R Perranoski",1.202,57,2,6,"1B","R Fairly",null,null,null,null,null,6,"1B","R Fairly",null,null,null,null,null,null,null,null,null,null,null,"Avg Slg% (50)",{"$f":"VLOOKUP(AA1,'Settings & Expansion'!M3:P137,3,FALSE)","v":0.372}]
["L Sherry",1.331,41,2,7,"3B","K McMullen",null,null,null,null,null,7,"3B","K McMullen",null,null,null,null,null,null,null,null,null,null,null,"Top Slg% (100)",0.58599999999999997]
["D Calmus",1.091,72,3,8,"C","J Roseboro",null,null,null,null,null,8,"C","J Roseboro"]
["E Roebuck",1.86,-28,3,9,"P","S Koufax",null,null,null,null,null,9,"P","S Koufax"]
["K Rowe",1.41,30,3,null,null,null,null,null,null,null,null,null,null,null,null,null,null,null,null,null,null,null,null,null,null,"Avg WHIP (50)",{"$f":"VLOOKUP(AA1,'Settings & Expansion'!M3:P137,4,FALSE)","v":1.2585}]
["P Richert",1.385,34,2,null,null,null,null,null,null,null,null,null,"P","S Koufax",null,null,null,null,null,null,null,null,null,null,null,"Low WHIP (100)",0.875]
["N Willhite",1.421,29,2]
["CATCHERS",null,"Contact","Power","Speed","Def/Arm","Bunt","Raw Avg","Raw Slg%",null,null,null,null,null,null,"IP","H","R","K","ERA",null,null,"BB"]
["J Roseboro",null,{"$f":"IF(H14=\"\",\"\",ROUND((50/($AB$3-$AB$2))*(H14-$AB$3)+100,0))","v":44},{"$f":"IF(I14=\"\",\"\",ROUND((50/($AB$7-$AB$6))*(I14-$AB$7)+100,0))","v":45},45,70,55,0.23599999999999999,0.35099999999999998,null,null,null,null,"Starter","S Koufax",null,null,null,null,{"$f":"IFERROR(IF(O14=\"\",\"\",R14*9/P14),\"INF\")","v":"INF"}]
["D Camilli",null,{"$f":"IF(H15=\"\",\"\",ROUND((50/($AB$3-$AB$2))*(H15-$AB$3)+100,0))","v":-2},{"$f":"IF(I15=\"\",\"\",ROUND((50/($AB$7-$AB$6))*(I15-$AB$7)+100,0))","v":25},40,55,60,0.16200000000000001,0.26500000000000001,null,null,null,null,null,null,null,null,null,null,""]
["INFIELDERS",null,"","",null,null,null,null,null,null,null,null,null,null,null,null,null,null,null,""]
["R Fairly",null,66,54,40,20,40,0.27100000000000002,0.38800000000000001,null,null,null,null,null,null,null,null,null,null,""]
["J Gilliam",null,73,53,65,20,70,0.28199999999999997,0.38300000000000001,null,null,null,null,null,null,null,null,null,null,""]
["M Wills",null,85,45,80,20,80,0.30199999999999999,0.34899999999999998,null,null,null,null,null,null,null,null,null,null,""]
["K McMullen",null,44,42,55,20,55,0.23599999999999999,0.33900000000000002,null,null,null,null,null,null,null,null,null,null,""]
["M Skowron",null,23,30,40,45,50,0.20300000000000001,0.28699999999999998,null,null,null,null,null,null,null,null,null,null,{"$f":"IF(O21=\"\",\"\",R21*9/P21)","v":""}]
["D Tracewski",null,38,23,60,20,60,0.22600000000000001,0.25800000000000001]
["N Oliver",null,46,35,55,20,55,0.23899999999999999,0.307,null,null,null,null,null,null,null,null,null,null,""]
["OUTFIELDERS",null,"",""]
["T Davis",null,100,70,65,65,55,0.32600000000000001,0.45700000000000002]
["W Davis",null,49,48,75,70,60,0.245,0.36499999999999999]
["F Howard",null,67,84,40,40,30,0.27300000000000002,0.51800000000000002]
["W Moon",null,60,52,55,60,60,0.26200000000000001,0.38200000000000001]
["L Walls",null,42,45,50,50,65,0.23300000000000001,0.34899999999999998]
[]
[]
[]
[]
[]
[]
[]
[]
[]
[]
[]
[]
[]
[null,null,"AB","H","RBI","Run","HR","3B","2B","SB"]
["PITCHERS",null,0,0,0,0,0,0,0,0]
["S Koufax",1,0,0,0,0,0,0,0,0]
["D Drysdale",null,0,0,0,0,0,0,0,0]
["J Podres",null,0,0,0,0,0,0,0,0]
["B Miller",null,0,0,0,0,0,0,0,0]
["R Perranoski",null,0,0,0,0,0,0,0,0]
["L Sherry",null,0,0,0,0,0,0,0,0]
["D Calmus",null,0,0,0,0,0,0,0,0]
["E Roebuck",null,0,0,0,0,0,0,0,0]
["K Rowe",null,0,0,0,0,0,0,0,0]
["P Richert",null,0,0,0,0,0,0,0,0]
["N Willhite",null,0,0,0,0,0,0,0,0]
["CATCHERS",null,0,0,0,0,0,0,0,0]
["J Roseboro",1,0,0,0,0,0,0,0,0]
["D Camilli",null,0,0,0,0,0,0,0,0]
["INFIELDERS",null,0,0,0,0,0,0,0,0]
["R Fairly",1,0,0,0,0,0,0,0,0]
["J Gilliam",1,0,0,0,0,0,0,0,0]
["M Wills",1,0,0,0,0,0,0,0,0]
["K McMullen",1,0,0,0,0,0,0,0,0]
["M Skowron",null,0,0,0,0,0,0,0,0]
["D Tracewski",null,0,0,0,0,0,0,0,0]
["N Oliver",null,0,0,0,0,0,0,0,0]
["OUTFIELDERS",null,0,0,0,0,0,0,0,0]
["T Davis",1,0,0,0,0,0,0,0,0]
["W Davis",1,0,0,0,0,0,0,0,0]
["F Howard",1,0,0,0,0,0,0,0,0]
["W Moon",null,0,0,0,0,0,0,0,0]
["L Walls",1,0,0,0,0,0,0,0,0]
[null,99,0,0,0,0,0,0,0,0]

{"sheet":"1961Yankees","index":24,"n_rows":73,"n_cols":28,"rows_kept":73,"cut":false,"hidden":false,"merged":[[0,26,0,27]]}
["PITCHERS","WHIP","Effectiveness","Stamina",1,"2B","B Richardson",null,1,"W Ford",null,null,1,"2B","B Richardson",null,null,null,null,null,null,null,null,null,null,null,1961]
["W Ford",1.18,{"$f":"IF(B2=\"\",\"\",ROUND((50/($AB$11-$AB$10))*(B2-$AB$11)+100,0))","v":75},1,2,"SS","T Kubek",null,2,"B Stafford",null,null,2,"SS","T Kubek",null,null,null,null,null,null,null,null,null,null,null,"Avg BA (50)",{"$f":"VLOOKUP(AA1,'Settings & Expansion'!M3:P137,2,FALSE)","v":0.25900000000000001}]
["B Stafford",1.1639999999999999,{"$f":"IF(B3=\"\",\"\",ROUND((50/($AB$11-$AB$10))*(B3-$AB$11)+100,0))","v":77},1,3,"CF","M Mantle",null,3,"R Terry",null,null,3,"CF","M Mantle",null,null,null,null,null,null,null,null,null,null,null,"Top BA (100)",0.36099999999999999]
["R Terry",1.083,88,1,4,"RF","R Maris",null,4,"R Sheldon",null,null,4,"RF","R Maris"]
["R Sheldon",1.254,66,1,5,"C","E Howard",null,null,null,null,null,5,"C","E Howard"]
["L Arroyo",1.109,85,2,6,"LF","Y Berra",null,null,null,null,null,6,"LF","Y Berra",null,null,null,null,null,null,null,null,null,null,null,"Avg Slg% (50)",{"$f":"VLOOKUP(AA1,'Settings & Expansion'!M3:P137,3,FALSE)","v":0.4}]
["J Coates",1.2809999999999999,62,2,7,"1B","M Skowron",null,null,null,null,null,7,"1B","M Skowron",null,null,null,null,null,null,null,null,null,null,null,"Top Slg% (100)",0.68700000000000006]
["H Reniff",1.3680000000000001,51,3,8,"3B","C Boyer",null,null,null,null,null,8,"3B","C Boyer"]
["T Clevenger",1.768,-2,3,9,"P","W Ford",null,null,null,null,null,9,"P","W Ford"]
["D McDevitt",2,-33,3,null,null,null,null,null,null,null,null,null,null,null,null,null,null,null,null,null,null,null,null,null,null,"Avg WHIP (50)",{"$f":"VLOOKUP(AA1,'Settings & Expansion'!M3:P137,4,FALSE)","v":1.3725000000000001}]
["B Daley",1.373,50,2,null,null,null,null,null,null,null,null,null,"P","W Ford",null,null,null,null,null,null,null,null,null,null,null,"Low WHIP (100)",0.99299999999999999]
["B Turley",1.736,2,2]
["CATCHERS",null,"Contact","Power","Speed","Def/Arm","Bunt","Raw Avg","Raw Slg%",null,null,null,null,null,null,"IP","H","R","K","ERA",null,null,"BB"]
["E Howard",null,{"$f":"IF(H14=\"\",\"\",ROUND((50/($AB$3-$AB$2))*(H14-$AB$3)+100,0))","v":94},{"$f":"IF(I14=\"\",\"\",ROUND((50/($AB$7-$AB$6))*(I14-$AB$7)+100,0))","v":76},40,80,55,0.34799999999999998,0.54900000000000004,null,null,null,null,"Starter","W Ford",null,null,null,null,{"$f":"IFERROR(IF(O14=\"\",\"\",R14*9/P14),\"INF\")","v":"INF"}]
["J Blanchard",null,{"$f":"IF(H15=\"\",\"\",ROUND((50/($AB$3-$AB$2))*(H15-$AB$3)+100,0))","v":73},{"$f":"IF(I15=\"\",\"\",ROUND((50/($AB$7-$AB$6))*(I15-$AB$7)+100,0))","v":87},45,60,60,0.30499999999999999,0.61299999999999999,null,null,null,null,null,null,null,null,null,null,""]
["INFIELDERS",null,"","",null,null,null,null,null,null,null,null,null,null,null,null,null,null,null,""]
["M Skowron",null,54,63,50,50,40,0.26700000000000002,0.47199999999999998,null,null,null,null,null,null,null,null,null,null,""]
["B Richardson",null,51,35,65,20,70,0.26100000000000001,0.316,null,null,null,null,null,null,null,null,null,null,""]
["T Kubek",null,58,49,65,20,60,0.27600000000000002,0.39500000000000002,null,null,null,null,null,null,null,null,null,null,""]
["C Boyer",null,33,41,60,20,65,0.224,0.34699999999999998,null,null,null,null,null,null,null,null,null,null,""]
["B Gardner",null,27,31,55,20,55,0.21199999999999999,0.29299999999999998,null,null,null,null,null,null,null,null,null,null,{"$f":"IF(O21=\"\",\"\",R21*9/P21)","v":""}]
["J DeMaestri",null,-5,6,60,20,65,0.14599999999999999,0.14599999999999999,null,null,null,null,null,null,null,null,null,null,""]
["OUTFIELDERS",null,"",""]
["Y Berra",null,56,61,50,55,60,0.27100000000000002,0.46600000000000003]
["M Mantle",null,78,100,75,75,30,0.317,0.68700000000000006]
["R Maris",null,55,88,60,60,35,0.26900000000000002,0.62]
["H Lopez",null,32,33,60,65,55,0.222,0.30499999999999999]
["B Cerv",null,56,64,55,60,60,0.27100000000000002,0.48299999999999998]
["J Reed",null,-1,7,65,40,55,0.154,0.154]
[]
[]
[]
[]
[]
[]
[]
[]
[]
[]
[]
[]
[]
[null,null,"AB","H","RBI","Run","HR","3B","2B","SB"]
["PITCHERS",null,0,0,0,0,0,0,0,0]
["W Ford",null,0,0,0,0,0,0,0,0]
["B Stafford",null,0,0,0,0,0,0,0,0]
["R Terry",1,0,0,0,0,0,0,0,0]
["R Sheldon",null,0,0,0,0,0,0,0,0]
["L Arroyo",null,0,0,0,0,0,0,0,0]
["J Coates",null,0,0,0,0,0,0,0,0]
["H Reniff",null,0,0,0,0,0,0,0,0]
["T Clevenger",null,0,0,0,0,0,0,0,0]
["D McDevitt",null,0,0,0,0,0,0,0,0]
["B Daley",null,0,0,0,0,0,0,0,0]
["B Turley",null,0,0,0,0,0,0,0,0]
["CATCHERS",null,0,0,0,0,0,0,0,0]
["E Howard",1,0,0,0,0,0,0,0,0]
["J Blanchard",null,0,0,0,0,0,0,0,0]
["INFIELDERS",null,0,0,0,0,0,0,0,0]
["M Skowron",1,0,0,0,0,0,0,0,0]
["B Richardson",null,0,0,0,0,0,0,0,0]
["T Kubek",1,0,0,0,0,0,0,0,0]
["C Boyer",1,0,0,0,0,0,0,0,0]
["B Gardner",null,0,0,0,0,0,0,0,0]
["J DeMaestri",1,0,0,0,0,0,0,0,0]
["OUTFIELDERS",null,0,0,0,0,0,0,0,0]
["Y Berra",1,0,0,0,0,0,0,0,0]
["M Mantle",1,0,0,0,0,0,0,0,0]
["R Maris",1,0,0,0,0,0,0,0,0]
["H Lopez",1,0,0,0,0,0,0,0,0]
["B Cerv",null,0,0,0,0,0,0,0,0]
["J Reed",null,0,0,0,0,0,0,0,0]
[null,99,0,0,0,0,0,0,0,0]

{"sheet":"1955Dodgers","index":25,"n_rows":73,"n_cols":28,"rows_kept":73,"cut":false,"hidden":false,"merged":[[0,26,0,27]]}
["PITCHERS","WHIP","Effectiveness","Stamina",1,"2B","J Gilliam",null,1,"D Newcombe",null,null,1,"2B","J Gilliam",null,null,null,null,null,null,null,null,null,null,null,1955]
["D Newcombe",1.113,{"$f":"IF(B2=\"\",\"\",ROUND((50/($AB$11-$AB$10))*(B2-$AB$11)+100,0))","v":95},1,2,"SS","P Reese",null,2,"C Erskine",null,null,2,"SS","P Reese",null,null,null,null,null,null,null,null,null,null,null,"Avg BA (50)",{"$f":"VLOOKUP(AA1,'Settings & Expansion'!M3:P137,2,FALSE)","v":0.25850000000000001}]
["C Erskine",1.2789999999999999,{"$f":"IF(B3=\"\",\"\",ROUND((50/($AB$11-$AB$10))*(B3-$AB$11)+100,0))","v":68},1,3,"CF","D Snider",null,3,"J Podres",null,null,3,"CF","D Snider",null,null,null,null,null,null,null,null,null,null,null,"Top BA (100)",0.34]
["J Podres",1.3620000000000001,55,1,4,"C","R Campanella",null,4,"B Loes",null,null,4,"C","R Campanella"]
["B Loes",1.266,70,1,5,"RF","C Furillo",null,null,null,null,null,5,"RF","C Furillo"]
["E Roebuck",1.429,44,3,6,"1B","G Hodges",null,null,null,null,null,6,"1B","G Hodges",null,null,null,null,null,null,null,null,null,null,null,"Avg Slg% (50)",{"$f":"VLOOKUP(AA1,'Settings & Expansion'!M3:P137,3,FALSE)","v":0.39400000000000002}]
["C Labine",1.2190000000000001,78,2,7,"3B","J Robinson",null,null,null,null,null,7,"3B","J Robinson",null,null,null,null,null,null,null,null,null,null,null,"Top Slg% (100)",0.65900000000000003]
["K Spooner",1.216,78,2,8,"LF","S Amaros",null,null,null,null,null,8,"LF","S Amaros"]
["D Bessent",1.137,91,3,9,"P","D Newcombe",null,null,null,null,null,9,"P","D Newcombe"]
["J Hughes",1.4059999999999999,48,3,null,null,null,null,null,null,null,null,null,null,null,null,null,null,null,null,null,null,null,null,null,null,"Avg WHIP (50)",{"$f":"VLOOKUP(AA1,'Settings & Expansion'!M3:P137,4,FALSE)","v":1.393}]
["R Meyer",1.603,16,2,null,null,null,null,null,null,null,null,null,"P","D Newcombe",null,null,null,null,null,null,null,null,null,null,null,"Low WHIP (100)",1.08]
["S Koufax",1.464,39,2]
["CATCHERS",null,"Contact","Power","Speed","Def/Arm","Bunt","Raw Avg","Raw Slg%",null,null,null,null,null,null,"IP","H","R","K","ERA",null,null,"BB"]
["R Campanella",null,{"$f":"IF(H14=\"\",\"\",ROUND((50/($AB$3-$AB$2))*(H14-$AB$3)+100,0))","v":87},{"$f":"IF(I14=\"\",\"\",ROUND((50/($AB$7-$AB$6))*(I14-$AB$7)+100,0))","v":86},40,75,50,0.318,0.58299999999999996,null,null,null,null,"Starter","D Newcombe",null,null,null,null,{"$f":"IFERROR(IF(O14=\"\",\"\",R14*9/P14),\"INF\")","v":"INF"}]
["R Walker",null,{"$f":"IF(H15=\"\",\"\",ROUND((50/($AB$3-$AB$2))*(H15-$AB$3)+100,0))","v":46},{"$f":"IF(I15=\"\",\"\",ROUND((50/($AB$7-$AB$6))*(I15-$AB$7)+100,0))","v":43},55,55,60,0.252,0.35899999999999999,null,null,null,null,null,null,null,null,null,null,""]
["INFIELDERS",null,"","",null,null,null,null,null,null,null,null,null,null,null,null,null,null,null,""]
["G Hodges",null,69,70,45,20,45,0.28899999999999998,0.5,null,null,null,null,null,null,null,null,null,null,""]
["J Gilliam",null,44,43,75,20,65,0.249,0.35499999999999998,null,null,null,null,null,null,null,null,null,null,""]
["P Reese",null,64,52,70,20,80,0.28199999999999997,0.40300000000000002,null,null,null,null,null,null,null,null,null,null,""]
["J Robinson",null,48,44,80,20,80,0.25600000000000001,0.36299999999999999,null,null,null,null,null,null,null,null,null,null,""]
["D Hoak",null,39,44,65,20,65,0.24,0.36199999999999999]
["D Zimmer",null,38,59,60,20,55,0.23899999999999999,0.443,null,null,null,null,null,null,null,null,null,null,{"$f":"IF(O22=\"\",\"\",R22*9/P22)","v":""}]
["F Kellert",null,91,84,40,20,30,0.32500000000000001,0.57499999999999996,null,null,null,null,null,null,null,null,null,null,""]
["OUTFIELDERS",null,"",""]
["S Amaros",null,43,52,70,75,55,0.247,0.40200000000000002]
["D Snider",null,81,94,60,65,40,0.309,0.628]
["C Furillo",null,84,74,60,80,60,0.314,0.52]
["G Shuba",null,60,46,55,75,40,0.27500000000000002,0.373]
["W Moryn",null,53,65,60,55,60,0.26300000000000001,0.47399999999999998]
[]
[]
[]
[]
[]
[]
[]
[]
[]
[]
[]
[]
[]
[null,null,"AB","H","RBI","Run","HR","3B","2B","SB"]
["PITCHERS",null,0,0,0,0,0,0,0,0]
["D Newcombe",null,0,0,0,0,0,0,0,0]
["C Erskine",null,0,0,0,0,0,0,0,0]
["J Podres",1,0,0,0,0,0,0,0,0]
["B Loes",null,0,0,0,0,0,0,0,0]
["E Roebuck",null,0,0,0,0,0,0,0,0]
["C Labine",null,0,0,0,0,0,0,0,0]
["K Spooner",null,0,0,0,0,0,0,0,0]
["D Bessent",null,0,0,0,0,0,0,0,0]
["J Hughes",null,0,0,0,0,0,0,0,0]
["R Meyer",null,0,0,0,0,0,0,0,0]
["S Koufax",null,0,0,0,0,0,0,0,0]
["CATCHERS",null,0,0,0,0,0,0,0,0]
["R Campanella",1,0,0,0,0,0,0,0,0]
["R Walker",null,0,0,0,0,0,0,0,0]
["INFIELDERS",null,0,0,0,0,0,0,0,0]
["G Hodges",1,0,0,0,0,0,0,0,0]
["J Gilliam",1,0,0,0,0,0,0,0,0]
["P Reese",1,0,0,0,0,0,0,0,0]
["J Robinson",1,0,0,0,0,0,0,0,0]
["D Hoak",1,0,0,0,0,0,0,0,0]
["D Zimmer",null,0,0,0,0,0,0,0,0]
["F Kellert",1,0,0,0,0,0,0,0,0]
["OUTFIELDERS",null,0,0,0,0,0,0,0,0]
["S Amaros",null,0,0,0,0,0,0,0,0]
["D Snider",1,0,0,0,0,0,0,0,0]
["C Furillo",1,0,0,0,0,0,0,0,0]
["G Shuba",null,0,0,0,0,0,0,0,0]
["W Moryn",null,0,0,0,0,0,0,0,0]
[null,99,0,0,0,0,0,0,0,0]

{"sheet":"1954Giants","index":26,"n_rows":73,"n_cols":28,"rows_kept":73,"cut":false,"hidden":false,"merged":[[0,26,0,27]]}
["PITCHERS","WHIP","Effectiveness","Stamina",1,"1B","W Lockman",null,1,"J Antonelli",null,null,1,"1B","W Lockman",null,null,null,null,null,null,null,null,null,null,null,1954]
["J Antonelli",1.171,{"$f":"IF(B2=\"\",\"\",ROUND((50/($AB$11-$AB$10))*(B2-$AB$11)+100,0))","v":80},1,2,"SS","A Dark",null,2,"R Gomez",null,null,2,"SS","A Dark",null,null,null,null,null,null,null,null,null,null,null,"Avg BA (50)",{"$f":"VLOOKUP(AA1,'Settings & Expansion'!M3:P137,2,FALSE)","v":0.26100000000000001}]
["R Gomez",1.403,{"$f":"IF(B3=\"\",\"\",ROUND((50/($AB$11-$AB$10))*(B3-$AB$11)+100,0))","v":49},1,3,"RF","D Mueller",null,3,"S Maglie",null,null,3,"RF","D Mueller",null,null,null,null,null,null,null,null,null,null,null,"Top BA (100)",0.34499999999999997]
["S Maglie",1.337,58,1,4,"CF","W Mays",null,4,"J Hearn",null,null,4,"CF","W Mays"]
["J Hearn",1.5620000000000001,28,1,5,"3B","H Thompson",null,null,null,null,null,5,"3B","H Thompson"]
["M Grissom",1.226,73,2,6,"LF","M Irvin",null,null,null,null,null,6,"LF","M Irvin",null,null,null,null,null,null,null,null,null,null,null,"Avg Slg% (50)",{"$f":"VLOOKUP(AA1,'Settings & Expansion'!M3:P137,3,FALSE)","v":0.39}]
["H Wilhelm",1.159,82,2,7,"2B","D Williams",null,null,null,null,null,7,"2B","D Williams",null,null,null,null,null,null,null,null,null,null,null,"Top Slg% (100)",0.66700000000000004]
["W McCall",1.2949999999999999,64,3,8,"C","W Westrum",null,null,null,null,null,8,"C","W Westrum"]
["L Jansen",1.77,1,3,9,"P","J Antonelli",null,null,null,null,null,9,"P","J Antonelli"]
["A Corwin",1.5640000000000001,28,3,null,null,null,null,null,null,null,null,null,null,null,null,null,null,null,null,null,null,null,null,null,null,"Avg WHIP (50)",{"$f":"VLOOKUP(AA1,'Settings & Expansion'!M3:P137,4,FALSE)","v":1.3980000000000001}]
["D Liddle",1.224,73,2,null,null,null,null,null,null,null,null,null,"P","J Antonelli",null,null,null,null,null,null,null,null,null,null,null,"Low WHIP (100)",1.022]
["A Worthington",2,-30,3]
["CATCHERS",null,"Contact","Power","Speed","Def/Arm","Bunt","Raw Avg","Raw Slg%",null,null,null,null,null,null,"IP","H","R","K","ERA",null,null,"BB"]
["W Westrum",null,{"$f":"IF(H14=\"\",\"\",ROUND((50/($AB$3-$AB$2))*(H14-$AB$3)+100,0))","v":6},{"$f":"IF(I14=\"\",\"\",ROUND((50/($AB$7-$AB$6))*(I14-$AB$7)+100,0))","v":35},55,75,60,0.187,0.30499999999999999,null,null,null,null,"Starter","J Antonelli",null,null,null,null,{"$f":"IFERROR(IF(O14=\"\",\"\",R14*9/P14),\"INF\")","v":"INF"}]
["R Katt",null,{"$f":"IF(H15=\"\",\"\",ROUND((50/($AB$3-$AB$2))*(H15-$AB$3)+100,0))","v":46},{"$f":"IF(I15=\"\",\"\",ROUND((50/($AB$7-$AB$6))*(I15-$AB$7)+100,0))","v":58},45,70,55,0.255,0.435,null,null,null,null,null,null,null,null,null,null,""]
["INFIELDERS",null,"","",null,null,null,null,null,null,null,null,null,null,null,null,null,null,null,""]
["W Lockman",null,44,47,45,20,55,0.251,0.375,null,null,null,null,null,null,null,null,null,null,""]
["D Williams",null,27,37,65,20,65,0.222,0.316,null,null,null,null,null,null,null,null,null,null,""]
["A Dark",null,69,60,75,20,75,0.29299999999999998,0.44600000000000001,null,null,null,null,null,null,null,null,null,null,""]
["H Thompson",null,51,67,60,20,60,0.26300000000000001,0.48199999999999998,null,null,null,null,null,null,null,null,null,null,""]
["B Hofman",null,28,62,60,20,55,0.224,0.45600000000000002,null,null,null,null,null,null,null,null,null,null,{"$f":"IF(O21=\"\",\"\",R21*9/P21)","v":""}]
["B Gardner",null,21,31,60,20,55,0.21299999999999999,0.28699999999999998,null,null,null,null,null,null,null,null,null,null,""]
["F Castleman",null,43,25,50,20,60,0.25,0.25]
["OUTFIELDERS",null,"",""]
["M Irvin",null,51,59,70,75,55,0.26200000000000001,0.438]
["W Mays",null,100,100,85,90,70,0.34499999999999997,0.66700000000000004]
["D Mueller",null,98,60,55,65,55,0.34200000000000003,0.44400000000000001]
["D Rhodes",null,98,105,45,60,55,0.34100000000000003,0.69499999999999995]
["B Taylor",null,5,32,70,40,70,0.185,0.29199999999999998]
[]
[]
[]
[]
[]
[]
[]
[]
[]
[]
[]
[]
[]
[null,null,"AB","H","RBI","Run","HR","3B","2B","SB"]
["PITCHERS",null,0,0,0,0,0,0,0,0]
["J Antonelli",null,0,0,0,0,0,0,0,0]
["R Gomez",1,0,0,0,0,0,0,0,0]
["S Maglie",null,0,0,0,0,0,0,0,0]
["J Hearn",null,0,0,0,0,0,0,0,0]
["M Grissom",null,0,0,0,0,0,0,0,0]
["H Wilhelm",null,0,0,0,0,0,0,0,0]
["W McCall",null,0,0,0,0,0,0,0,0]
["L Jansen",null,0,0,0,0,0,0,0,0]
["A Corwin",null,0,0,0,0,0,0,0,0]
["D Liddle",null,0,0,0,0,0,0,0,0]
["A Worthington",null,0,0,0,0,0,0,0,0]
["CATCHERS",null,0,0,0,0,0,0,0,0]
["W Westrum",1,0,0,0,0,0,0,0,0]
["R Katt",null,0,0,0,0,0,0,0,0]
["INFIELDERS",null,0,0,0,0,0,0,0,0]
["W Lockman",1,0,0,0,0,0,0,0,0]
["D Williams",1,0,0,0,0,0,0,0,0]
["A Dark",1,0,0,0,0,0,0,0,0]
["H Thompson",1,0,0,0,0,0,0,0,0]
["B Hofman",null,0,0,0,0,0,0,0,0]
["B Gardner",null,0,0,0,0,0,0,0,0]
["F Castleman",null,0,0,0,0,0,0,0,0]
["OUTFIELDERS",null,0,0,0,0,0,0,0,0]
["M Irvin",1,0,0,0,0,0,0,0,0]
["W Mays",1,0,0,0,0,0,0,0,0]
["D Mueller",1,0,0,0,0,0,0,0,0]
["D Rhodes",null,0,0,0,0,0,0,0,0]
["B Taylor",null,0,0,0,0,0,0,0,0]
[null,99,0,0,0,0,0,0,0,0]

{"sheet":"1948Indians","index":27,"n_rows":73,"n_cols":28,"rows_kept":73,"cut":false,"hidden":false,"merged":[[0,26,0,27]]}
["PITCHERS","WHIP","Effectiveness","Stamina",1,"LF","D Mitchell",null,1,"B Lemon",null,null,1,"LF","D Mitchell",null,null,null,null,null,null,null,null,null,null,null,1948]
["B Lemon",1.226,{"$f":"IF(B2=\"\",\"\",ROUND((50/($AB$11-$AB$10))*(B2-$AB$11)+100,0))","v":77},1,2,"CF","L Doby",null,2,"B Feller",null,null,2,"CF","L Doby",null,null,null,null,null,null,null,null,null,null,null,"Avg BA (50)",{"$f":"VLOOKUP(AA1,'Settings & Expansion'!M3:P137,2,FALSE)","v":0.26350000000000001}]
["B Feller",1.323,{"$f":"IF(B3=\"\",\"\",ROUND((50/($AB$11-$AB$10))*(B3-$AB$11)+100,0))","v":66},1,3,"SS","L Boudreau",null,3,"G Bearden",null,null,3,"SS","L Boudreau",null,null,null,null,null,null,null,null,null,null,null,"Top BA (100)",0.376]
["G Bearden",1.276,71,1,4,"2B","J Gordon",null,4,"S Zoldak",null,null,4,"2B","J Gordon"]
["S Zoldak",1.2110000000000001,79,1,5,"3B","K Keltner",null,null,null,null,null,5,"3B","K Keltner"]
["R Christopher",1.39,57,3,6,"RF","W Judnich",null,null,null,null,null,6,"RF","W Judnich",null,null,null,null,null,null,null,null,null,null,null,"Avg Slg% (50)",{"$f":"VLOOKUP(AA1,'Settings & Expansion'!M3:P137,3,FALSE)","v":0.38250000000000001}]
["S Gromek",1.2310000000000001,77,2,7,"1B","E Robinson",null,null,null,null,null,7,"1B","E Robinson",null,null,null,null,null,null,null,null,null,null,null,"Top Slg% (100)",0.70199999999999996]
["E Klieman",1.3560000000000001,62,2,8,"C","J Hegan",null,null,null,null,null,8,"C","J Hegan"]
["S Paige",1.1419999999999999,87,2,9,"P","B Lemon",null,null,null,null,null,9,"P","B Lemon"]
["B Muncrief",1.4790000000000001,47,2,null,null,null,null,null,null,null,null,null,null,null,null,null,null,null,null,null,null,null,null,null,null,"Avg WHIP (50)",{"$f":"VLOOKUP(AA1,'Settings & Expansion'!M3:P137,4,FALSE)","v":1.452}]
["D Black",1.865,0,3,null,null,null,null,null,null,null,null,null,"P","B Lemon",null,null,null,null,null,null,null,null,null,null,null,"Low WHIP (100)",1.0369999999999999]
["B Kennedy",2.5590000000000002,-83,3]
["CATCHERS",null,"Contact","Power","Speed","Def/Arm","Bunt","Raw Avg","Raw Slg%",null,null,null,null,null,null,"IP","H","R","K","ERA",null,null,"BB"]
["J Hegan",null,{"$f":"IF(H14=\"\",\"\",ROUND((50/($AB$3-$AB$2))*(H14-$AB$3)+100,0))","v":43},{"$f":"IF(I14=\"\",\"\",ROUND((50/($AB$7-$AB$6))*(I14-$AB$7)+100,0))","v":54},55,75,60,0.248,0.40699999999999997,null,null,null,null,"Starter","B Lemon",null,null,null,null,{"$f":"IFERROR(IF(O14=\"\",\"\",R14*9/P14),\"INF\")","v":"INF"}]
["J Tipton",null,{"$f":"IF(H15=\"\",\"\",ROUND((50/($AB$3-$AB$2))*(H15-$AB$3)+100,0))","v":61},{"$f":"IF(I15=\"\",\"\",ROUND((50/($AB$7-$AB$6))*(I15-$AB$7)+100,0))","v":46},60,55,55,0.28899999999999998,0.35599999999999998,null,null,null,null,null,null,null,null,null,null,""]
["INFIELDERS",null,{"$f":"IF(H16=\"\",\"\",ROUND((50/($AB$3-$AB$2))*(H16-$AB$3)+100,0))","v":""},"",null,null,null,null,null,null,null,null,null,null,null,null,null,null,null,""]
["E Robinson",null,46,54,40,20,40,0.254,0.40799999999999997,null,null,null,null,null,null,null,null,null,null,""]
["J Gordon",null,57,69,70,20,75,0.28000000000000003,0.50700000000000001,null,null,null,null,null,null,null,null,null,null,""]
["L Boudreau",null,91,74,65,20,65,0.35499999999999998,0.53400000000000003,null,null,null,null,null,null,null,null,null,null,""]
["K Keltner",null,65,72,60,20,55,0.29699999999999999,0.52200000000000002,null,null,null,null,null,null,null,null,null,null,""]
["W Judnich",null,47,48,60,20,45,0.25700000000000001,0.372,null,null,null,null,null,null,null,null,null,null,{"$f":"IF(O21=\"\",\"\",R21*9/P21)","v":""}]
["J Berardino",null,17,34,75,20,65,0.19,0.27900000000000003,null,null,null,null,null,null,null,null,null,null,""]
["A Rosen",null,22,21,55,20,55,0.2,0.2]
["OUTFIELDERS",null,"",""]
["T Tucker",null,48,44,70,65,60,0.26,0.34300000000000003]
["L Doby",null,67,67,65,70,45,0.30099999999999999,0.49]
["D Mitchell",null,82,58,60,70,60,0.33600000000000002,0.43099999999999999]
["A Clark",null,71,59,55,60,55,0.31,0.443]
["H Edwards",null,52,54,65,55,70,0.26900000000000002,0.40600000000000003]
[]
[]
[]
[]
[]
[]
[]
[]
[]
[]
[]
[]
[]
[null,null,"AB","H","RBI","Run","HR","3B","2B","SB"]
["PITCHERS",null,0,0,0,0,0,0,0,0]
["B Lemon",null,0,0,0,0,0,0,0,0]
["B Feller",null,0,0,0,0,0,0,0,0]
["G Bearden",1,0,0,0,0,0,0,0,0]
["S Zoldak",null,0,0,0,0,0,0,0,0]
["R Christopher",null,0,0,0,0,0,0,0,0]
["S Gromek",null,0,0,0,0,0,0,0,0]
["E Klieman",null,0,0,0,0,0,0,0,0]
["S Paige",null,0,0,0,0,0,0,0,0]
["B Muncrief",null,0,0,0,0,0,0,0,0]
["D Black",null,0,0,0,0,0,0,0,0]
["B Kennedy",null,0,0,0,0,0,0,0,0]
["CATCHERS",null,0,0,0,0,0,0,0,0]
["J Hegan",1,0,0,0,0,0,0,0,0]
["J Tipton",null,0,0,0,0,0,0,0,0]
["INFIELDERS",null,0,0,0,0,0,0,0,0]
["E Robinson",1,0,0,0,0,0,0,0,0]
["J Gordon",null,0,0,0,0,0,0,0,0]
["L Boudreau",1,0,0,0,0,0,0,0,0]
["K Keltner",null,0,0,0,0,0,0,0,0]
["W Judnich",1,0,0,0,0,0,0,0,0]
["J Berardino",1,0,0,0,0,0,0,0,0]
["A Rosen",null,0,0,0,0,0,0,0,0]
["OUTFIELDERS",null,0,0,0,0,0,0,0,0]
["T Tucker",null,0,0,0,0,0,0,0,0]
["L Doby",1,0,0,0,0,0,0,0,0]
["D Mitchell",null,0,0,0,0,0,0,0,0]
["A Clark",1,0,0,0,0,0,0,0,0]
["H Edwards",1,0,0,0,0,0,0,0,0]
[null,99,0,0,0,0,0,0,0,0]

{"sheet":"1941Yankees","index":28,"n_rows":73,"n_cols":23,"rows_kept":73,"cut":false,"hidden":false,"merged":[]}
["PITCHERS",null,"Effectiveness","Stamina",1,"CF","D DeJesus",null,1,"Z Greinke",null,null,1,"CF","D DeJesus"]
["Z Greinke",null,60,1,2,"C","J Kendall",null,2,"K Davies",null,null,2,"C","J Kendall"]
["K Davies",null,31,1,3,"1B","B Butler",null,3,"B Chen",null,null,3,"1B","B Butler"]
["B Chen",null,48,1,4,"3B","W Betemit",null,4,"B Bannister",null,null,4,"3B","W Betemit"]
["B Bannister",null,25,1,5,"DH","K Ka'aihue",null,null,null,null,null,5,"DH","K Ka'aihue"]
["J Soria",null,77,3,6,"LF","A Gordon",null,null,null,null,null,6,"LF","A Gordon"]
["R Tejeda",null,52,3,7,"2B","M Aviles",null,null,null,null,null,7,"2B","M Aviles"]
["D Hughes",null,39,3,8,"RF","M Maier",null,null,null,null,null,8,"RF","M Maier"]
["B Wood",null,34,3,9,"SS","Y Betancourt",null,null,null,null,null,9,"SS","Y Betancourt"]
["K Farnsworth",null,67,3]
["L Hochevar",null,43,2,null,null,null,null,null,null,null,null,null,"P","Z Greinke"]
["S O'Sullivan",null,31,2]
["CATCHERS",null,"Contact","Power","Speed","Def/Arm","Bunt",null,null,null,null,null,null,null,null,"IP","H","R","K","ERA",null,null,"BB"]
["J Kendall",null,47,29,55,55,70,null,null,null,null,null,null,"Starter","Z Greinke",null,null,null,null,{"$f":"IFERROR(IF(O14=\"\",\"\",R14*9/P14),\"INF\")","v":"INF"}]
["B Pena",null,46,37,40,55,60,null,null,null,null,null,null,null,null,null,null,null,null,""]
["INFIELDERS",null,null,null,null,null,null,null,null,null,null,null,null,null,null,null,null,null,null,""]
["B Butler",null,82,64,50,20,40,null,null,null,null,null,null,null,null,null,null,null,null,""]
["M Aviles",null,74,53,65,20,60,null,null,null,null,null,null,null,null,null,null,null,null,""]
["Y Betancourt",null,49,51,65,20,45,null,null,null,null,null,null,null,null,null,null,null,null,""]
["A Callaspo",null,58,52,65,20,65,null,null,null,null,null,null,null,null,null,null,null,null,""]
["W Betemit",null,70,72,65,40,50,null,null,null,null,null,null,null,null,null,null,null,null,{"$f":"IF(O21=\"\",\"\",R21*9/P21)","v":""}]
["C Getz",null,37,25,60,20,60,null,null,null,null,null,null,null,null,null,null,null,null,""]
["K Ka'aihue",null,25,49,45,20,40]
["OUTFIELDERS"]
["S Podsednik",null,78,50,80,40,75]
["M Maier",null,51,45,60,65,55]
["D DeJesus",null,82,59,75,80,75]
["J Guillen",null,47,56,60,85,35]
["A Gordon",null,24,41,60,60,60]
[]
[]
[]
[]
[]
[]
[]
[]
[]
[]
[]
[]
[]
[null,null,"AB","H","RBI","Run","HR","3B","2B","SB"]
["PITCHERS",null,0,0,0,0,0,0,0,0]
["Z Greinke",1,0,0,0,0,0,0,0,0]
["K Davies",null,0,0,0,0,0,0,0,0]
["B Chen",null,0,0,0,0,0,0,0,0]
["B Bannister",null,0,0,0,0,0,0,0,0]
["J Soria",null,0,0,0,0,0,0,0,0]
["R Tejeda",null,0,0,0,0,0,0,0,0]
["D Hughes",null,0,0,0,0,0,0,0,0]
["B Wood",null,0,0,0,0,0,0,0,0]
["K Farnsworth",null,0,0,0,0,0,0,0,0]
["L Hochevar",null,0,0,0,0,0,0,0,0]
["S O'Sullivan",null,0,0,0,0,0,0,0,0]
["CATCHERS",null,0,0,0,0,0,0,0,0]
["J Kendall",1,0,0,0,0,0,0,0,0]
["B Pena",null,0,0,0,0,0,0,0,0]
["INFIELDERS",null,0,0,0,0,0,0,0,0]
["B Butler",1,0,0,0,0,0,0,0,0]
["M Aviles",1,0,0,0,0,0,0,0,0]
["Y Betancourt",1,0,0,0,0,0,0,0,0]
["A Callaspo",null,0,0,0,0,0,0,0,0]
["W Betemit",1,0,0,0,0,0,0,0,0]
["C Getz",null,0,0,0,0,0,0,0,0]
["K Ka'aihue",1,0,0,0,0,0,0,0,0]
["OUTFIELDERS",null,0,0,0,0,0,0,0,0]
["S Podsednik",null,0,0,0,0,0,0,0,0]
["M Maier",1,0,0,0,0,0,0,0,0]
["D DeJesus",1,0,0,0,0,0,0,0,0]
["J Guillen",null,0,0,0,0,0,0,0,0]
["A Gordon",1,0,0,0,0,0,0,0,0]
[null,99,0,0,0,0,0,0,0,0]

{"sheet":"1941RedSox","index":29,"n_rows":73,"n_cols":23,"rows_kept":73,"cut":false,"hidden":false,"merged":[]}
["PITCHERS",null,"Effectiveness","Stamina",1,"CF","A Jackson",null,1,"J Verlander",null,null,1,"CF","A Jackson"]
["J Verlander",null,67,1,2,"2B","W Rhymes",null,2,"M Scherzer",null,null,2,"2B","W Rhymes"]
["M Scherzer",null,59,1,3,"1B","M Cabrera",null,3,"J Bonderman",null,null,3,"1B","M Cabrera"]
["J Bonderman",null,41,1,4,"LF","B Boesch",null,4,"R Porcello",null,null,4,"LF","B Boesch"]
["R Porcello",null,46,1,5,"3B","J Peralta",null,null,null,null,null,5,"3B","J Peralta"]
["J Valverde",null,67,3,6,"RF","R Raburn",null,null,null,null,null,6,"RF","R Raburn"]
["B Thomas",null,34,2,7,"DH","C Guillen",null,null,null,null,null,7,"DH","C Guillen"]
["E Bonine",null,31,2,8,"C","A Avila",null,null,null,null,null,8,"C","A Avila"]
["P Coke",null,42,3,9,"SS","R Santiago",null,null,null,null,null,9,"SS","R Santiago"]
["R Perry",null,60,3]
["A Galarraga",null,51,2,null,null,null,null,null,null,null,null,null,"P","J Bonderman"]
["J Zumaya",null,71,3]
["CATCHERS",null,"Contact","Power","Speed","Def/Arm","Bunt",null,null,null,null,null,null,null,null,"IP","H","R","K","ERA",null,null,"BB"]
["A Avila",null,31,38,55,65,60,null,null,null,null,null,null,"Starter","J Bonderman",null,null,null,null,{"$f":"IFERROR(IF(O14=\"\",\"\",R14*9/P14),\"INF\")","v":"INF"}]
["G Laird",null,20,31,40,60,65,null,null,null,null,null,null,null,null,null,null,null,null,""]
["INFIELDERS",null,null,null,null,null,null,null,null,null,null,null,null,null,null,null,null,null,null,""]
["M Cabrera",null,88,94,55,55,35,null,null,null,null,null,null,null,null,null,null,null,null,""]
["W Rhymes",null,74,53,70,20,70,null,null,null,null,null,null,null,null,null,null,null,null,""]
["R Santiago",null,51,35,70,20,75,null,null,null,null,null,null,null,null,null,null,null,null,""]
["B Inge",null,42,49,65,40,60,null,null,null,null,null,null,null,null,null,null,null,null,""]
["C Guillen",null,57,54,35,20,70,null,null,null,null,null,null,null,null,null,null,null,null,{"$f":"IF(O21=\"\",\"\",R21*9/P21)","v":""}]
["J Peralta",null,46,49,40,20,40,null,null,null,null,null,null,null,null,null,null,null,null,""]
["S Sizemore",null,29,37,70,20,65]
["OUTFIELDERS"]
["R Raburn",null,61,65,70,70,65]
["M Ordonez",null,74,65,60,60,50]
["J Damon",null,56,50,65,30,65]
["B Boesch",null,47,53,65,70,60]
["A Jackson",null,68,50,75,75,55]
[]
[]
[]
[]
[]
[]
[]
[]
[]
[]
[]
[]
[]
[null,null,"AB","H","RBI","Run","HR","3B","2B","SB"]
["PITCHERS",null,0,0,0,0,0,0,0,0]
["J Verlander",null,0,0,0,0,0,0,0,0]
["M Scherzer",null,0,0,0,0,0,0,0,0]
["J Bonderman",1,0,0,0,0,0,0,0,0]
["R Porcello",null,0,0,0,0,0,0,0,0]
["J Valverde",null,0,0,0,0,0,0,0,0]
["B Thomas",null,0,0,0,0,0,0,0,0]
["E Bonine",null,0,0,0,0,0,0,0,0]
["P Coke",null,0,0,0,0,0,0,0,0]
["R Perry",null,0,0,0,0,0,0,0,0]
["A Galarraga",null,0,0,0,0,0,0,0,0]
["J Zumaya",null,0,0,0,0,0,0,0,0]
["CATCHERS",null,0,0,0,0,0,0,0,0]
["A Avila",1,0,0,0,0,0,0,0,0]
["G Laird",null,0,0,0,0,0,0,0,0]
["INFIELDERS",null,0,0,0,0,0,0,0,0]
["M Cabrera",1,0,0,0,0,0,0,0,0]
["W Rhymes",1,0,0,0,0,0,0,0,0]
["R Santiago",1,0,0,0,0,0,0,0,0]
["B Inge",null,0,0,0,0,0,0,0,0]
["C Guillen",1,0,0,0,0,0,0,0,0]
["J Peralta",1,0,0,0,0,0,0,0,0]
["S Sizemore",null,0,0,0,0,0,0,0,0]
["OUTFIELDERS",null,0,0,0,0,0,0,0,0]
["R Raburn",1,0,0,0,0,0,0,0,0]
["M Ordonez",null,0,0,0,0,0,0,0,0]
["J Damon",null,0,0,0,0,0,0,0,0]
["B Boesch",1,0,0,0,0,0,0,0,0]
["A Jackson",1,0,0,0,0,0,0,0,0]
[null,99,0,0,0,0,0,0,0,0]

{"sheet":"1935Tigers","index":30,"n_rows":73,"n_cols":23,"rows_kept":73,"cut":false,"hidden":false,"merged":[]}
["PITCHERS",null,"Effectiveness","Stamina",1,"CF","D Span",null,1,"C Pavano",null,null,1,"CF","D Span"]
["C Pavano",null,64,1,2,"2B","O Hudson",null,2,"F Liriano",null,null,2,"2B","O Hudson"]
["F Liriano",null,58,1,3,"C","J Mauer",null,3,"S Baker",null,null,3,"C","J Mauer"]
["S Baker",null,51,1,4,"1B","J Morneau",null,4,"N Blackburn",null,null,4,"1B","J Morneau"]
["N Blackburn",null,41,1,5,"LF","D Young",null,null,null,null,null,5,"LF","D Young"]
["M Capps",null,65,3,6,"DH","J Thome",null,null,null,null,null,6,"DH","J Thome"]
["J Rauch",null,54,3,7,"3B","D Valencia",null,null,null,null,null,7,"3B","D Valencia"]
["B Duensing",null,63,2,8,"SS","J Hardy",null,null,null,null,null,8,"SS","J Hardy"]
["M Guerrier",null,73,3,9,"RF","M Cuddyer",null,null,null,null,null,9,"RF","M Cuddyer"]
["J Crain",null,66,3]
["J Mijares",null,53,3,null,null,null,null,null,null,null,null,null,"P","S Baker"]
["R Mahay",null,63,3]
["CATCHERS",null,"Contact","Power","Speed","Def/Arm","Bunt",null,null,null,null,null,null,null,null,"IP","H","R","K","ERA",null,null,"BB"]
["J Mauer",null,87,64,60,75,60,null,null,null,null,null,null,"Starter","S Baker",null,null,null,null,{"$f":"IFERROR(IF(O14=\"\",\"\",R14*9/P14),\"INF\")","v":"INF"}]
["D Butera",null,14,29,50,60,55,null,null,null,null,null,null,null,null,null,null,null,null,""]
["INFIELDERS",null,null,null,null,null,null,null,null,null,null,null,null,null,null,null,null,null,null,""]
["O Hudson",null,54,44,75,20,75,null,null,null,null,null,null,null,null,null,null,null,null,""]
["J Hardy",null,54,49,60,20,60,null,null,null,null,null,null,null,null,null,null,null,null,""]
["D Valencia",null,78,60,60,20,55,null,null,null,null,null,null,null,null,null,null,null,null,""]
["J Thome",null,62,95,30,20,20,null,null,null,null,null,null,null,null,null,null,null,null,""]
["J Morneau",null,97,94,50,20,25,null,null,null,null,null,null,null,null,null,null,null,null,{"$f":"IF(O21=\"\",\"\",R21*9/P21)","v":""}]
["N Punto",null,37,30,70,20,80,null,null,null,null,null,null,null,null,null,null,null,null,""]
["A Casilla",null,58,49,70,20,75]
["OUTFIELDERS"]
["M Cuddyer",null,56,53,60,60,70]
["D Young",null,71,69,65,70,60]
["D Span",null,52,40,75,70,75]
["J Kubel",null,43,55,50,65,40]
["J Repko",null,31,39,70,50,60]
[]
[]
[]
[]
[]
[]
[]
[]
[]
[]
[]
[]
[]
[null,null,"AB","H","RBI","Run","HR"]
["PITCHERS",null,0,0,0,0,0,0,0,0]
["C Pavano",null,0,0,0,0,0,0,0,0]
["F Liriano",null,0,0,0,0,0,0,0,0]
["S Baker",1,0,0,0,0,0,0,0,0]
["N Blackburn",null,0,0,0,0,0,0,0,0]
["M Capps",null,0,0,0,0,0,0,0,0]
["J Rauch",null,0,0,0,0,0,0,0,0]
["B Duensing",null,0,0,0,0,0,0,0,0]
["M Guerrier",null,0,0,0,0,0,0,0,0]
["J Crain",null,0,0,0,0,0,0,0,0]
["J Mijares",null,0,0,0,0,0,0,0,0]
["R Mahay",null,0,0,0,0,0,0,0,0]
["CATCHERS",null,0,0,0,0,0,0,0,0]
["J Mauer",1,0,0,0,0,0,0,0,0]
["D Butera",null,0,0,0,0,0,0,0,0]
["INFIELDERS",null,0,0,0,0,0,0,0,0]
["M Cuddyer",1,0,0,0,0,0,0,0,0]
["O Hudson",1,0,0,0,0,0,0,0,0]
["J Hardy",1,0,0,0,0,0,0,0,0]
["D Valencia",1,0,0,0,0,0,0,0,0]
["J Thome",1,0,0,0,0,0,0,0,0]
["J Morneau",1,0,0,0,0,0,0,0,0]
["N Punto",null,0,0,0,0,0,0,0,0]
["A Casilla",null,0,0,0,0,0,0,0,0]
["OUTFIELDERS",null,0,0,0,0,0,0,0,0]
["D Young",1,0,0,0,0,0,0,0,0]
["D Span",1,0,0,0,0,0,0,0,0]
["J Kubel",null,0,0,0,0,0,0,0,0]
["J Repko",null,0,0,0,0,0,0,0,0]
[null,99,0,0,0,0,0,0,0,0]

{"sheet":"1934Cardinals","index":31,"n_rows":73,"n_cols":23,"rows_kept":73,"cut":false,"hidden":false,"merged":[]}
["PITCHERS",null,"Effectiveness","Stamina",1,"LF","J Pierre",null,1,"J Danks",null,null,1,"LF","J Pierre"]
["J Danks",null,62,1,2,"SS","A Ramirez",null,2,"M Buehrle",null,null,2,"SS","A Ramirez"]
["M Buehrle",null,45,1,3,"CF","A Rios",null,3,"G Floyd",null,null,3,"CF","A Rios"]
["G Floyd",null,48,1,4,"1B","P Konerko",null,4,"F Garcia",null,null,4,"1B","P Konerko"]
["F Garcia",null,48,1,5,"RF","A Jones",null,null,null,null,null,5,"RF","A Jones"]
["B Jenks",null,48,3,6,"C","A Pierzynski",null,null,null,null,null,6,"C","A Pierzynski"]
["T Pena",null,35,2,7,"3B","D Viciedo",null,null,null,null,null,7,"3B","D Viciedo"]
["M Thornton",null,81,3,8,"2B","G Beckham",null,null,null,null,null,8,"2B","G Beckham"]
["J Putz",null,78,3,9,"DH","C Quentin",null,null,null,null,null,9,"DH","C Quentin"]
["S Santos",null,34,3]
["S Linebrink",null,52,3,null,null,null,null,null,null,null,null,null,"P","M Buehrle"]
["J Peavy",null,61,2]
["CATCHERS",null,"Contact","Power","Speed","Def/Arm","Bunt",null,null,null,null,null,null,null,null,"IP","H","R","K","ERA",null,null,"BB"]
["A Pierzynski",null,55,48,55,40,60,null,null,null,null,null,null,"Starter","M Buehrle",null,1,null,null,{"$f":"IFERROR(IF(O14=\"\",\"\",R14*9/P14),\"INF\")","v":"INF"}]
["R Castro",null,60,71,30,60,60,null,null,null,null,null,null,null,null,null,null,null,null,""]
["INFIELDERS",null,null,null,null,null,null,null,null,null,null,null,null,null,null,null,null,null,null,""]
["P Konerko",null,79,87,35,20,30,null,null,null,null,null,null,null,null,null,null,null,null,""]
["G Beckham",null,45,46,65,20,65,null,null,null,null,null,null,null,null,null,null,null,null,""]
["A Ramirez",null,62,56,65,20,55,null,null,null,null,null,null,null,null,null,null,null,null,""]
["O Vizquel",null,58,36,50,20,70,null,null,null,null,null,null,null,null,null,null,null,null,""]
["M Teahen",null,48,46,60,20,60,null,null,null,null,null,null,null,null,null,null,null,null,{"$f":"IF(O21=\"\",\"\",R21*9/P21)","v":""}]
["D Viciedo",null,76,74,55,20,60,null,null,null,null,null,null,null,null,null,null,null,null,""]
["M Kotsay",null,38,45,60,70,45]
["OUTFIELDERS"]
["J Pierre",null,58,33,90,40,70]
["A Rios",null,63,61,75,80,55]
["C Quentin",null,40,66,40,50,35]
["A Jones",null,33,67,60,65,40]
["M Ramirez",null,50,34,40,40,25]
[]
[]
[]
[]
[]
[]
[]
[]
[]
[]
[]
[]
[]
[null,null,"AB","H","RBI","Run","HR","3B","2B","SB"]
["PITCHERS",null,0,0,0,0,0,0,0,0]
["J Danks",null,0,0,0,0,0,0,0,0]
["M Buehrle",1,0,0,0,0,0,0,0,0]
["G Floyd",null,0,0,0,0,0,0,0,0]
["F Garcia",null,0,0,0,0,0,0,0,0]
["B Jenks",null,0,0,0,0,0,0,0,0]
["T Pena",null,0,0,0,0,0,0,0,0]
["M Thornton",null,0,0,0,0,0,0,0,0]
["J Putz",null,0,0,0,0,0,0,0,0]
["S Santos",null,0,0,0,0,0,0,0,0]
["S Linebrink",null,0,0,0,0,0,0,0,0]
["J Peavy",null,0,0,0,0,0,0,0,0]
["CATCHERS",null,0,0,0,0,0,0,0,0]
["A Pierzynski",1,0,0,0,0,0,0,0,0]
["R Castro",null,0,0,0,0,0,0,0,0]
["INFIELDERS",null,0,0,0,0,0,0,0,0]
["P Konerko",1,0,0,0,0,0,0,0,0]
["G Beckham",1,0,0,0,0,0,0,0,0]
["A Ramirez",1,0,0,0,0,0,0,0,0]
["O Vizquel",null,0,0,0,0,0,0,0,0]
["M Teahen",null,0,0,0,0,0,0,0,0]
["D Viciedo",1,0,0,0,0,0,0,0,0]
["M Kotsay",null,0,0,0,0,0,0,0,0]
["OUTFIELDERS",null,0,0,0,0,0,0,0,0]
["J Pierre",1,0,0,0,0,0,0,0,0]
["A Rios",1,0,0,0,0,0,0,0,0]
["C Quentin",1,0,0,0,0,0,0,0,0]
["A Jones",1,0,0,0,0,0,0,0,0]
["M Ramirez",null,0,0,0,0,0,0,0,0]
[null,99,0,0,0,0,0,0,0,0]

{"sheet":"1927Yankees","index":32,"n_rows":73,"n_cols":23,"rows_kept":73,"cut":false,"hidden":false,"merged":[]}
["PITCHERS",null,"Effectiveness","Stamina",1,"SS","D Jeter",null,1,"C Sabathia",null,null,1,"SS","D Jeter"]
["C Sabathia",null,64,1,2,"RF","N Swisher",null,2,"A Burnett",null,null,2,"RF","N Swisher"]
["A Burnett",null,35,1,3,"1B","M Teixeira",null,3,"P Hughes",null,null,3,"1B","M Teixeira"]
["P Hughes",null,59,1,4,"3B","A Rodriguez",null,4,"A Pettitte",null,null,4,"3B","A Rodriguez"]
["A Pettitte",null,57,1,5,"2B","R Cano",null,null,null,null,null,5,"2B","R Cano"]
["M Rivera",null,97,3,6,"DH","M Thames",null,null,null,null,null,6,"DH","M Thames"]
["J Chamberlin",null,55,3,7,"C","J Posada",null,null,null,null,null,7,"C","J Posada"]
["D Robertson",null,36,3,8,"CF","C Granderson",null,null,null,null,null,8,"CF","C Granderson"]
["C Gaudin",null,48,2,9,"LF","B Gardner",null,null,null,null,null,9,"LF","B Gardner"]
["B Logan",null,50,3]
["J Vazquez",null,46,2,null,null,null,null,null,null,null,null,null,"P","A Burnett"]
["D Moseley",null,43,2]
["CATCHERS",null,"Contact","Power","Speed","Def/Arm","Bunt",null,null,null,null,null,null,null,null,"IP","H","R","K","ERA",null,null,"BB"]
["J Posada",null,43,61,30,65,65,null,null,null,null,null,null,"Starter","A Burnett",null,null,null,null,{"$f":"IFERROR(IF(O14=\"\",\"\",R14*9/P14),\"INF\")","v":"INF"}]
["F Cervelli",null,56,37,45,60,60,null,null,null,null,null,null,null,null,null,null,null,null,""]
["INFIELDERS",null,null,null,null,null,null,null,null,null,null,null,null,null,null,null,null,null,null,""]
["M Teixeira",null,47,66,50,20,35,null,null,null,null,null,null,null,null,null,null,null,null,""]
["R Cano",null,83,77,60,20,55,null,null,null,null,null,null,null,null,null,null,null,null,""]
["D Jeter",null,55,44,70,20,70,null,null,null,null,null,null,null,null,null,null,null,null,""]
["A Rodriguez",null,55,71,60,20,40,null,null,null,null,null,null,null,null,null,null,null,null,""]
["R Pena",null,31,19,70,20,60,null,null,null,null,null,null,null,null,null,null,null,null,{"$f":"IF(O21=\"\",\"\",R21*9/P21)","v":""}]
["L Berkman",null,47,40,35,50,35,null,null,null,null,null,null,null,null,null,null,null,null,""]
["N Johnson",null,-3,31,30,20,30]
["OUTFIELDERS"]
["B Gardner",null,59,46,75,65,70]
["C Granderson",null,42,64,75,70,60]
["N Swisher",null,65,72,60,60,30]
["M Thames",null,65,68,55,55,50]
["A Kearns",null,35,35,50,60,45]
[]
[]
[]
[]
[]
[]
[]
[]
[]
[]
[]
[]
[]
[null,null,"AB","H","RBI","Run","HR","3B","2B","SB"]
["PITCHERS",null,0,0,0,0,0,0,0,0]
["C Sabathia",null,0,0,0,0,0,0,0,0]
["A Burnett",1,0,0,0,0,0,0,0,0]
["P Hughes",null,0,0,0,0,0,0,0,0]
["A Pettitte",null,0,0,0,0,0,0,0,0]
["M Rivera",null,0,0,0,0,0,0,0,0]
["J Chamberlin",null,0,0,0,0,0,0,0,0]
["D Robertson",null,0,0,0,0,0,0,0,0]
["C Gaudin",null,0,0,0,0,0,0,0,0]
["B Logan",null,0,0,0,0,0,0,0,0]
["J Vazquez",null,0,0,0,0,0,0,0,0]
["D Moseley",null,0,0,0,0,0,0,0,0]
["CATCHERS",null,0,0,0,0,0,0,0,0]
["J Posada",1,0,0,0,0,0,0,0,0]
["F Cervelli",null,0,0,0,0,0,0,0,0]
["INFIELDERS",null,0,0,0,0,0,0,0,0]
["M Teixeira",1,0,0,0,0,0,0,0,0]
["R Cano",1,0,0,0,0,0,0,0,0]
["D Jeter",1,1,1,0,0,0,0,0,0]
["A Rodriguez",1,0,0,0,0,0,0,0,0]
["R Pena",null,0,0,0,0,0,0,0,0]
["L Berkman",null,0,0,0,0,0,0,0,0]
["N Johnson",null,0,0,0,0,0,0,0,0]
["OUTFIELDERS",null,0,0,0,0,0,0,0,0]
["B Gardner",1,0,0,0,0,0,0,0,0]
["C Granderson",1,0,0,0,0,0,0,0,0]
["N Swisher",1,0,0,0,0,0,0,0,0]
["M Thames",1,0,0,0,0,0,0,0,0]
["A Kearns",null,0,0,0,0,0,0,0,0]
[null,99,0,0,0,0,0,0,0,0]

{"sheet":"Production","index":33,"n_rows":38,"n_cols":6,"rows_kept":38,"cut":false,"hidden":true,"merged":[]}
[]
[]
[]
[]
[]
[]
[]
[]
[]
[]
[]
[]
[]
[]
[]
[]
[]
[]
[]
[]
["Date","Units","Shipped to","Units Sold","Profit","Valuable  transaction?"]
["2007-01-14",302,4,278,{"$f":"(B22-D22)*31.58","v":757.92},{"$f":"IF(E22>5000,\"Y\",\"N\")","v":"N"}]
["2007-03-18",286,10,91,{"$f":"(B23-D23)*31.58","v":6158.0999999999995},{"$f":"IF(E23>5000,\"Y\",\"N\")","v":"Y"}]
["2007-04-25",646,3,480,5242.28,"Y"]
["2007-07-05",580,7,331,7863.4199999999992,"Y"]
["2007-07-13",627,10,455,5431.7599999999993,"Y"]
["2007-08-14",520,2,269,7926.58,"Y"]
["2007-08-20",541,7,346,6158.0999999999995,"Y"]
["2007-10-08",515,8,226,9126.619999999999,"Y"]
["2008-03-04",199,7,-89,9095.0399999999991,"Y"]
["2008-04-05",224,11,16,6568.6399999999994,"Y"]
["2008-04-28",378,10,327,1610.58,"N"]
["2008-06-06",423,11,305,3726.4399999999996,"N"]
["2008-08-24",308,5,256,1642.1599999999999,"N"]
["2008-08-29",563,3,386,5589.66,"Y"]
["2008-09-26",562,8,336,7137.08,"Y"]
["2008-09-27",660,9,550,3473.7999999999997,"N"]
["2008-10-24",400,1,130,8526.6,"Y"]